{"text_format":"1","workbook":"xlsx","n_sheets":16,"sheets":["Instructions","JAN","FEB","MAR","APR","MAY","JUNE","JULY","AUG","SEPT","OCT","NOV","DEC","OVERALL","Monthly Avg","Commitments"],"not_rendered":{"charts":7,"images":0,"macros":0,"external_links":0,"defined_names":1,"comments":2,"pivot_tables":0},"unopened":[],"bounds":{"document_bytes":16777216,"sheet_cells":100000,"rows_first":2000,"rows_last":500,"rows_between":2000,"halvings":0,"cell_chars":16384,"cell_head_chars":4096},"cells_cut":0,"cells_raw":0,"read":"whole","date_system":"1900"}

{"sheet":"Instructions","index":0,"n_rows":28,"n_cols":4,"rows_kept":28,"cut":false,"hidden":false,"merged":[[8,1,8,10],[10,1,10,10],[4,1,4,10],[0,0,0,7],[2,1,2,10],[6,1,6,10],[25,1,25,10],[12,1,12,10],[14,1,14,10],[16,1,16,10],[18,2,18,10],[17,2,17,10],[23,2,23,10]]}
["Instructions to use this Monthly Report form:"]
[]
["1)","When you first get the file, SAVE AS and RENAME it to your church's name - like \"2017 City Church Monthly Report\""]
[]
["2)","Answer all 3 questions to the right of the long answers.  This will put in the proper data headings."]
[]
["3)","Type in your church's name and your name as pastor."]
[]
["4)","Only fill in the blocks that are colored yellow.  The rest will be automatically calculated.  Cells with formulas are locked so that you cannot change or accidentally delete them."]
[]
["5)","The written bottom half is just as important as the numbers on top.  It maintains a ministry diary for reflection and assessment.  Don't skip this."]
[]
["6)","To the right of that is the 10 Commitments Table - another reflective tool.  Be honest about where you are at.  Everyone has good months and bad months.  This helps by recognizing how you are doing and feeling."]
[]
["7)","Save your work.  Then email the file to your district leader at the beginning of each month."]
[]
["8)","The tabs at the end give a series of annual summaries."]
[null,null,"\"Commitments\" gives a complete summary the 10 commitments"]
[null,null,"\"OVERALL\" automatically assembles all of your weekly statistics throughout the year.  Use this for analysis and year end reports."]
[null,null,null,"w Annual totals at top"]
[null,null,null,"w Two weekly graphs of attendance and giving"]
[null,null,null,"w Complete data from the year"]
[]
[null,null,"\"Monthly Avg\" automatically calculates the monthly averages on worship attendance and giving.  Includes graphs."]
[]
["9)","To modify this form, you simply have to turn off the \"protection\".  Do that by going to Tools--Protection--Unprotect.  There is no password on it.  I recommend re-protecting it again to preserve the many formulas."]
[]
["10)","If you have a problem, contact me at thenoel@gfree.org"]

{"sheet":"JAN","index":1,"n_rows":49,"n_cols":28,"rows_kept":49,"cut":false,"hidden":false,"merged":[[29,0,33,12],[31,15,31,16],[29,15,29,16],[28,0,28,12],[28,14,31,14],[22,19,23,19],[22,17,23,17],[26,15,26,16],[30,15,30,16],[33,15,33,16],[24,14,27,14],[32,15,32,16],[15,15,15,21],[4,27,4,28],[47,1,47,12],[35,0,39,12],[32,14,33,14],[34,0,34,12],[45,1,45,12],[0,3,0,9],[21,0,21,12],[28,15,28,16],[22,18,23,18],[13,0,13,12],[27,15,27,16],[11,14,11,22],[14,15,14,21],[13,15,13,19],[16,15,16,18],[2,2,2,5],[14,0,20,12],[22,0,27,12],[22,14,23,16],[24,15,24,16],[25,15,25,16],[17,15,17,21],[48,1,48,12],[42,1,42,12],[40,0,40,12],[46,0,46,12],[41,1,41,12],[43,1,43,12],[44,1,44,12]]}
[null,null,"Monthly Report on",{"$f":"IF(O12=\"\",\"TYPE THE CHURCH NAME HERE\",\"\")","v":""},null,null,null,null,null,null,"Church",null,null,null,{"$f":"IF(C3=\"\",\"\",\"You only fill in cells that are colored yellow.\")","v":""}]
[]
[null,"Pastor:",{"$f":"IF(O12=\"\",\"TYPE PASTOR NAME HERE\",\"\")","v":""},null,null,null,null,null,null,"For Month of ","JANUARY",null,2018]
[]
["Week","Worship Attend",{"$f":"IF(O16=\"yes\",\"Adults\",\"\")","v":""},{"$f":"IF(O16=\"\",\"\",IF(O16=\"yes\",\"CC\",\"\"))","v":""},"Giving",{"$f":"IF(O17=\"yes\",\"Child  SS\",\"\")","v":""},{"$f":"IF(O17=\"yes\",\"Adult SS\",\"\")","v":""},"SG or Other",{"$f":"IF(O18=\"yes\",\"Total Youth\",\"Youth Group\")","v":"Youth Group"},"Conversions","Baptisms","Growth decisions","Members Added",null,{"$f":"IF(O14>1,\"1st Service\",\"Worship Service\")","v":"Worship Service"},{"$f":"IF(O14>1,\"2nd Service\",\"\")","v":""},{"$f":"IF(O14>2,\"3rd Service\",\"\")","v":""},{"$f":"IF(O16=\"\",\"\",IF(O16=\"yes\",\"CC 1\",\"\"))","v":""},{"$f":"IF(O16=\"\",\"\",IF(AND(O16=\"yes\",O14>1)=TRUE,\"CC 2\",\"\"))","v":""},{"$f":"IF(O16=\"\",\"\",IF(AND(O16=\"yes\",O14=3)=TRUE,\"CC 3\",\"\"))","v":""},{"$f":"IF(O18=\"yes\",\"Jr. Youth\", \"\")","v":""},{"$f":"IF(O18=\"yes\",\"Sr. Youth\",\"\")","v":""},{"$f":"IF(O15=\"yes\",\"Worship duplicates\",\"\")","v":""},null,null,null,null,{"$f":"IF(OR(O16=\"\",O17=\"\",O18=\"\")=TRUE,\"START HERE BY ANSWERING THESE 3 QUESTIONS  with yes or no\",\"\")","v":"START HERE BY ANSWERING THESE 3 QUESTIONS  with yes or no"}]
[1,{"$f":"IF($O$16=\"no\",SUM(O6:Q6)-W6,SUM(C6:D6))","v":0},{"$f":"IF($C$5=\"Adults\",IF(SUM(O6:Q6)=0,\"\",SUM(O6:Q6)-W6),0)","v":0},{"$f":"IF($D$5=\"CC\",IF(SUM(R6:T6)=0,\"\",SUM(R6:T6)),0)","v":0},null,{"$f":"IF($F$5=\"\",0,\"\")","v":0},{"$f":"IF($G$5=\"\",0,\"\")","v":0},null,{"$f":"IF($I$5=\"Total Youth\",IF(SUM(U6:V6)=0,\"\",SUM(U6:V6)),0)","v":0},null,null,null,null,null,null,{"$f":"IF($P$5=\"\",0,\"\")","v":0},{"$f":"IF($Q$5=\"\",0,\"\")","v":0},{"$f":"IF($R$5=\"\",0,\"\")","v":0},{"$f":"IF($S$5=\"\",0,\"\")","v":0},{"$f":"IF($T$5=\"\",0,\"\")","v":0},{"$f":"IF($U$5=\"\",0,\"\")","v":0},{"$f":"IF($V$5=\"\",0,\"\")","v":0},{"$f":"IF($W$5=\"\",0,1)","v":0}]
[2,{"$f":"IF($O$16=\"no\",SUM(O7:Q7)-W7,SUM(C7:D7))","v":0},{"$f":"IF($C$5=\"Adults\",IF(SUM(O7:Q7)=0,\"\",SUM(O7:Q7)-W7),0)","v":0},{"$f":"IF($D$5=\"CC\",IF(SUM(R7:T7)=0,\"\",SUM(R7:T7)),0)","v":0},null,{"$f":"IF($F$5=\"\",0,\"\")","v":0},{"$f":"IF($G$5=\"\",0,\"\")","v":0},null,{"$f":"IF($I$5=\"Total Youth\",IF(SUM(U7:V7)=0,\"\",SUM(U7:V7)),0)","v":0},null,null,null,null,null,null,{"$f":"IF($P$5=\"\",0,\"\")","v":0},{"$f":"IF($Q$5=\"\",0,\"\")","v":0},{"$f":"IF($R$5=\"\",0,\"\")","v":0},{"$f":"IF($S$5=\"\",0,\"\")","v":0},{"$f":"IF($T$5=\"\",0,\"\")","v":0},{"$f":"IF($U$5=\"\",0,\"\")","v":0},{"$f":"IF($V$5=\"\",0,\"\")","v":0},{"$f":"IF($W$5=\"\",0,1)","v":0}]
[3,{"$f":"IF($O$16=\"no\",SUM(O8:Q8)-W8,SUM(C8:D8))","v":0},{"$f":"IF($C$5=\"Adults\",IF(SUM(O8:Q8)=0,\"\",SUM(O8:Q8)-W8),0)","v":0},{"$f":"IF($D$5=\"CC\",IF(SUM(R8:T8)=0,\"\",SUM(R8:T8)),0)","v":0},null,{"$f":"IF($F$5=\"\",0,\"\")","v":0},{"$f":"IF($G$5=\"\",0,\"\")","v":0},null,{"$f":"IF($I$5=\"Total Youth\",IF(SUM(U8:V8)=0,\"\",SUM(U8:V8)),0)","v":0},null,null,null,null,null,null,{"$f":"IF($P$5=\"\",0,\"\")","v":0},{"$f":"IF($Q$5=\"\",0,\"\")","v":0},{"$f":"IF($R$5=\"\",0,\"\")","v":0},{"$f":"IF($S$5=\"\",0,\"\")","v":0},{"$f":"IF($T$5=\"\",0,\"\")","v":0},{"$f":"IF($U$5=\"\",0,\"\")","v":0},{"$f":"IF($V$5=\"\",0,\"\")","v":0},{"$f":"IF($W$5=\"\",0,1)","v":0}]
[4,{"$f":"IF($O$16=\"no\",SUM(O9:Q9)-W9,SUM(C9:D9))","v":0},{"$f":"IF($C$5=\"Adults\",IF(SUM(O9:Q9)=0,\"\",SUM(O9:Q9)-W9),0)","v":0},{"$f":"IF($D$5=\"CC\",IF(SUM(R9:T9)=0,\"\",SUM(R9:T9)),0)","v":0},null,{"$f":"IF($F$5=\"\",0,\"\")","v":0},{"$f":"IF($G$5=\"\",0,\"\")","v":0},null,{"$f":"IF($I$5=\"Total Youth\",IF(SUM(U9:V9)=0,\"\",SUM(U9:V9)),0)","v":0},null,null,null,null,null,null,{"$f":"IF($P$5=\"\",0,\"\")","v":0},{"$f":"IF($Q$5=\"\",0,\"\")","v":0},{"$f":"IF($R$5=\"\",0,\"\")","v":0},{"$f":"IF($S$5=\"\",0,\"\")","v":0},{"$f":"IF($T$5=\"\",0,\"\")","v":0},{"$f":"IF($U$5=\"\",0,\"\")","v":0},{"$f":"IF($V$5=\"\",0,\"\")","v":0},{"$f":"IF($W$5=\"\",0,1)","v":0}]
[]
["Totals",{"$f":"IF(SUM(B6:B10)=0,\"\",SUM(B6:B10))","v":""},{"$f":"IF(SUM(C6:C10)=0,\"\",SUM(C6:C10))","v":""},"","","",{"$f":"IF(SUM(G6:G10)=0,\"\",SUM(G6:G10))","v":""},"","",{"$f":"IF(COUNTA(J6:J10)=0,\"\",SUM(J6:J10))","v":""},{"$f":"IF(COUNTA(K6:K10)=0,\"\",SUM(K6:K10))","v":""},{"$f":"IF(COUNTA(L6:L10)=0,\"\",SUM(L6:L10))","v":""},{"$f":"IF(COUNTA(M6:M10)=0,\"\",SUM(M6:M10))","v":""}]
["Avgs",{"$f":"IF(B11=\"\",\"\",SUM(B6:B10)/COUNTIF(B6:B10,\">0\"))","v":""},"","","","","","","",null,null,null,null,null,{"$f":"IF(COUNTA(O14:O18)<5,\"START HERE BY ANSWERING ALL 5 QUESTIONS\",\"\")","v":"START HERE BY ANSWERING ALL 5 QUESTIONS"}]
[]
["The most exciting thing that happened this month:",null,null,null,null,null,null,null,null,null,null,null,null,null,null,"How many worship services do you have?",null,null,null,null,"yes","no"]
[null,null,null,null,null,null,null,null,null,null,null,null,null,null,null,{"$f":"IF(O14=1,\"Mark this answer NO\",\"Do you subtract your worship service DUPLICATES at the end?\")","v":"Do you subtract your worship service DUPLICATES at the end?"}]
[null,null,null,null,null,null,null,null,null,null,null,null,null,null,null,"Do kids attend Child Church (CC) instead of being in the service?"]
[null,null,null,null,null,null,null,null,null,null,null,null,null,null,null,"Do you have Sunday School (SS)?",null,null,null,null,null,"x"]
[null,null,null,null,null,null,null,null,null,null,null,null,null,null,null,"Do you have separate Jr. and Sr. youth programs during week?"]
[]
[null,null,null,null,null,null,null,null,null,null,null,null,null,null,"How are you doing with The Ten Commitments?"]
[null,null,null,null,null,null,null,null,null,null,null,null,null,null,"Assess yourself by putting an X in the category that best describes your status"]
["The most challenging issue that is happening:"]
[null,null,null,null,null,null,null,null,null,null,null,null,null,null,"The Three Spheres",null,null,"A tough month","Doing ok","Doing great"]
[]
[null,null,null,null,null,null,null,null,null,null,null,null,null,null,"Fit","Physically",null,null,null,null,{"$f":"IF(COUNTA(R25:T25)>1,\"MARK ONLY ONE COLUMN\",IF(R25=\"x\",1,IF(S25=\"x\",2,IF(T25=\"X\",3,\"\"))))","v":""}]
[null,null,null,null,null,null,null,null,null,null,null,null,null,null,null,"Intellectually",null,null,null,null,{"$f":"IF(COUNTA(R26:T26)>1,\"MARK ONLY ONE COLUMN\",IF(R26=\"x\",1,IF(S26=\"x\",2,IF(T26=\"X\",3,\"\"))))","v":""}]
[null,null,null,null,null,null,null,null,null,null,null,null,null,null,null,"Relationally",null,null,null,null,""]
[null,null,null,null,null,null,null,null,null,null,null,null,null,null,null,"Spiritually",null,null,null,null,""]
["What I plan to do about it:",null,null,null,null,null,null,null,null,null,null,null,null,null,"Faithful","Marriage",null,null,null,null,""]
[null,null,null,null,null,null,null,null,null,null,null,null,null,null,null,"Parenting",null,null,null,null,""]
[null,null,null,null,null,null,null,null,null,null,null,null,null,null,null,"Ministry",null,null,null,null,""]
[null,null,null,null,null,null,null,null,null,null,null,null,null,null,null,"Finances",null,null,null,null,""]
[null,null,null,null,null,null,null,null,null,null,null,null,null,null,"Fruitful","The Lost",null,null,null,null,""]
[null,null,null,null,null,null,null,null,null,null,null,null,null,null,null,"Other Believers",null,null,null,null,""]
["Where I see the ministry heading:"]
[]
[]
[]
[]
[]
["Plans to accomplish this (my goals for next month):"]
["1)"]
["2)"]
["3)"]
["4) "]
["5) "]
["Book(s) currently reading or classes taking:"]
["1)"]
["2)"]

{"sheet":"FEB","index":2,"n_rows":49,"n_cols":23,"rows_kept":49,"cut":false,"hidden":false,"merged":[[42,1,42,12],[43,1,43,12],[0,3,0,8],[35,0,39,12],[14,0,20,12],[22,0,27,12],[29,0,33,12],[2,1,2,3],[34,0,34,12],[13,0,13,12],[18,14,21,14],[18,15,18,16],[19,15,19,16],[20,15,20,16],[40,0,40,12],[41,1,41,12],[48,1,48,12],[45,1,45,12],[46,0,46,12],[47,1,47,12],[21,15,21,16],[21,0,21,12],[28,0,28,12],[23,15,23,16],[25,15,25,16],[22,15,22,16],[44,1,44,12],[16,18,17,18],[26,14,27,14],[16,19,17,19],[16,17,17,17],[16,14,17,16],[24,15,24,16],[26,15,26,16],[27,15,27,16],[22,14,25,14]]}
[null,null,"Monthly Report on",{"$f":"JAN!D1","v":""},null,null,null,null,null,"Church",null,null,null,null,null,null,null,null,null,null,null,"x"]
[]
["Pastor:",{"$f":"JAN!C3","v":""},null,null,null,null,null,null,"For Month of ",null,null,"FEBRUARY",{"$f":"JAN!M3","v":2018}]
[]
["Week",{"$f":"JAN!B5","v":"Worship Attend"},{"$f":"JAN!C5","v":""},{"$f":"JAN!D5","v":""},{"$f":"JAN!E5","v":"Giving"},{"$f":"JAN!F5","v":""},{"$f":"JAN!G5","v":""},{"$f":"JAN!H5","v":"SG or Other"},{"$f":"JAN!I5","v":"Youth Group"},{"$f":"JAN!J5","v":"Conversions"},{"$f":"JAN!K5","v":"Baptisms"},{"$f":"JAN!L5","v":"Growth decisions"},{"$f":"JAN!M5","v":"Members Added"},null,{"$f":"JAN!O5","v":"Worship Service"},{"$f":"JAN!P5","v":""},{"$f":"JAN!Q5","v":""},{"$f":"JAN!R5","v":""},{"$f":"JAN!S5","v":""},{"$f":"JAN!T5","v":""},{"$f":"JAN!U5","v":""},{"$f":"JAN!V5","v":""},{"$f":"JAN!W5","v":""}]
[1,{"$f":"IF(JAN!$O$16=\"no\",SUM(O6:Q6)-W6,SUM(C6:D6))","v":0},{"$f":"IF($C$5=\"Adults\",IF(SUM(O6:Q6)=0,\"\",SUM(O6:Q6)-W6),0)","v":0},{"$f":"IF($D$5=\"CC\",IF(SUM(R6:T6)=0,\"\",SUM(R6:T6)),0)","v":0},null,{"$f":"IF($F$5=\"\",0,\"\")","v":0},{"$f":"IF($G$5=\"\",0,\"\")","v":0},null,{"$f":"IF($I$5=\"Total Youth\",IF(SUM(U6:V6)=0,\"\",SUM(U6:V6)),0)","v":0},null,null,null,null,null,null,{"$f":"IF($P$5=\"\",0,\"\")","v":0},{"$f":"IF($Q$5=\"\",0,\"\")","v":0},{"$f":"IF($R$5=\"\",0,\"\")","v":0},{"$f":"IF($S$5=\"\",0,\"\")","v":0},{"$f":"IF($T$5=\"\",0,\"\")","v":0},null,{"$f":"IF($V$5=\"\",0,\"\")","v":0},{"$f":"IF($W$5=\"\",0,1)","v":0}]
[2,{"$f":"IF(JAN!$O$16=\"no\",SUM(O7:Q7)-W7,SUM(C7:D7))","v":0},{"$f":"IF($C$5=\"Adults\",IF(SUM(O7:Q7)=0,\"\",SUM(O7:Q7)),0)","v":0},{"$f":"IF($D$5=\"CC\",IF(SUM(R7:T7)=0,\"\",SUM(R7:T7)),0)","v":0},null,{"$f":"IF($F$5=\"\",0,\"\")","v":0},{"$f":"IF($G$5=\"\",0,\"\")","v":0},null,{"$f":"IF($I$5=\"Total Youth\",IF(SUM(U7:V7)=0,\"\",SUM(U7:V7)),0)","v":0},null,null,null,null,null,null,{"$f":"IF($P$5=\"\",0,\"\")","v":0},{"$f":"IF($Q$5=\"\",0,\"\")","v":0},{"$f":"IF($R$5=\"\",0,\"\")","v":0},{"$f":"IF($S$5=\"\",0,\"\")","v":0},{"$f":"IF($T$5=\"\",0,\"\")","v":0},null,{"$f":"IF($V$5=\"\",0,\"\")","v":0},{"$f":"IF($W$5=\"\",0,1)","v":0}]
[3,{"$f":"IF(JAN!$O$16=\"no\",SUM(O8:Q8)-W8,SUM(C8:D8))","v":0},{"$f":"IF($C$5=\"Adults\",IF(SUM(O8:Q8)=0,\"\",SUM(O8:Q8)),0)","v":0},{"$f":"IF($D$5=\"CC\",IF(SUM(R8:T8)=0,\"\",SUM(R8:T8)),0)","v":0},null,{"$f":"IF($F$5=\"\",0,\"\")","v":0},{"$f":"IF($G$5=\"\",0,\"\")","v":0},null,{"$f":"IF($I$5=\"Total Youth\",IF(SUM(U8:V8)=0,\"\",SUM(U8:V8)),0)","v":0},null,null,null,null,null,null,{"$f":"IF($P$5=\"\",0,\"\")","v":0},{"$f":"IF($Q$5=\"\",0,\"\")","v":0},{"$f":"IF($R$5=\"\",0,\"\")","v":0},{"$f":"IF($S$5=\"\",0,\"\")","v":0},{"$f":"IF($T$5=\"\",0,\"\")","v":0},null,{"$f":"IF($V$5=\"\",0,\"\")","v":0},{"$f":"IF($W$5=\"\",0,1)","v":0}]
[4,{"$f":"IF(JAN!$O$16=\"no\",SUM(O9:Q9)-W9,SUM(C9:D9))","v":0},{"$f":"IF($C$5=\"Adults\",IF(SUM(O9:Q9)=0,\"\",SUM(O9:Q9)),0)","v":0},{"$f":"IF($D$5=\"CC\",IF(SUM(R9:T9)=0,\"\",SUM(R9:T9)),0)","v":0},null,{"$f":"IF($F$5=\"\",0,\"\")","v":0},{"$f":"IF($G$5=\"\",0,\"\")","v":0},null,{"$f":"IF($I$5=\"Total Youth\",IF(SUM(U9:V9)=0,\"\",SUM(U9:V9)),0)","v":0},null,null,null,null,null,null,{"$f":"IF($P$5=\"\",0,\"\")","v":0},{"$f":"IF($Q$5=\"\",0,\"\")","v":0},{"$f":"IF($R$5=\"\",0,\"\")","v":0},{"$f":"IF($S$5=\"\",0,\"\")","v":0},{"$f":"IF($T$5=\"\",0,\"\")","v":0},null,{"$f":"IF($V$5=\"\",0,\"\")","v":0},{"$f":"IF($W$5=\"\",0,1)","v":0}]
[null,{"$f":"IF(JAN!$O$16=\"no\",SUM(O10:Q10)-W10,SUM(C10:D10))","v":0}]
["Totals",{"$f":"IF(SUM(B6:B10)=0,\"\",SUM(B6:B10))","v":""},{"$f":"IF(SUM(C6:C10)=0,\"\",SUM(C6:C10))","v":""},"","","",{"$f":"IF(SUM(G6:G10)=0,\"\",SUM(G6:G10))","v":""},"","",{"$f":"IF(COUNTA(J6:J10)=0,\"\",SUM(J6:J10))","v":""},{"$f":"IF(COUNTA(K6:K10)=0,\"\",SUM(K6:K10))","v":""},{"$f":"IF(COUNTA(L6:L10)=0,\"\",SUM(L6:L10))","v":""},{"$f":"IF(COUNTA(M6:M10)=0,\"\",SUM(M6:M10))","v":""}]
["Avgs",{"$f":"IF(B11=\"\",\"\",SUM(B6:B10)/COUNTIF(B6:B10,\">0\"))","v":""},"","","","","","",""]
[]
["The most exciting thing that happened this month:",null,null,null,null,null,null,null,null,null,null,null,null,null,"How are you doing with The Ten Commitments?",null,null,null,null,null,"x"]
[null,null,null,null,null,null,null,null,null,null,null,null,null,null,"Assess yourself by putting an X in the category that best describes your status"]
[]
[null,null,null,null,null,null,null,null,null,null,null,null,null,null,"The Three Spheres",null,null,{"$f":"JAN!R23","v":"A tough month"},{"$f":"JAN!S23","v":"Doing ok"},{"$f":"JAN!T23","v":"Doing great"}]
[]
[null,null,null,null,null,null,null,null,null,null,null,null,null,null,"Fit","Physically",null,null,null,null,{"$f":"IF(COUNTA(R19:T19)>1,\"MARK ONLY ONE COLUMN\",IF(R19=\"x\",1,IF(S19=\"x\",2,IF(T19=\"X\",3,\"\"))))","v":""}]
[null,null,null,null,null,null,null,null,null,null,null,null,null,null,null,"Intellectually",null,null,null,null,{"$f":"IF(COUNTA(R20:T20)>1,\"MARK ONLY ONE COLUMN\",IF(R20=\"x\",1,IF(S20=\"x\",2,IF(T20=\"X\",3,\"\"))))","v":""}]
[null,null,null,null,null,null,null,null,null,null,null,null,null,null,null,"Relationally",null,null,null,null,""]
["The most challenging issue that is happening:",null,null,null,null,null,null,null,null,null,null,null,null,null,null,"Spiritually",null,null,null,null,""]
[null,null,null,null,null,null,null,null,null,null,null,null,null,null,"Faithful","Marriage",null,null,null,null,""]
[null,null,null,null,null,null,null,null,null,null,null,null,null,null,null,"Parenting",null,null,null,null,""]
[null,null,null,null,null,null,null,null,null,null,null,null,null,null,null,"Ministry",null,null,null,null,""]
[null,null,null,null,null,null,null,null,null,null,null,null,null,null,null,"Finances",null,null,null,null,""]
[null,null,null,null,null,null,null,null,null,null,null,null,null,null,"Fruitful","The Lost",null,null,null,null,""]
[null,null,null,null,null,null,null,null,null,null,null,null,null,null,null,"Other Believers",null,null,null,null,""]
["What I plan to do about it:"]
[]
[]
[]
[]
[]
["Where I see the ministry heading:"]
[]
[]
[]
[]
[]
["Plans to accomplish this (my goals for next month):"]
["1)"]
["2)"]
["3)"]
["4) "]
["5) "]
["Book(s) currently reading or classes taking:"]
["1)"]
["2)"]

{"sheet":"MAR","index":3,"n_rows":49,"n_cols":23,"rows_kept":49,"cut":false,"hidden":false,"merged":[[42,1,42,12],[43,1,43,12],[0,3,0,8],[35,0,39,12],[14,0,20,12],[22,0,27,12],[29,0,33,12],[2,1,2,3],[34,0,34,12],[13,0,13,12],[18,14,21,14],[18,15,18,16],[19,15,19,16],[20,15,20,16],[40,0,40,12],[41,1,41,12],[48,1,48,12],[45,1,45,12],[46,0,46,12],[47,1,47,12],[21,15,21,16],[21,0,21,12],[28,0,28,12],[23,15,23,16],[25,15,25,16],[22,15,22,16],[44,1,44,12],[16,18,17,18],[26,14,27,14],[16,19,17,19],[16,17,17,17],[16,14,17,16],[24,15,24,16],[26,15,26,16],[27,15,27,16],[22,14,25,14]]}
[null,null,"Monthly Report on",{"$f":"JAN!D1","v":""},null,null,null,null,null,"Church",null,null,null,null,null,null,null,null,null,null,null,"x"]
[]
["Pastor:",{"$f":"JAN!C3","v":""},null,null,null,null,null,null,null,"For Month of ","MARCH",null,{"$f":"JAN!M3","v":2018}]
[]
["Week",{"$f":"JAN!B5","v":"Worship Attend"},{"$f":"JAN!C5","v":""},{"$f":"JAN!D5","v":""},{"$f":"JAN!E5","v":"Giving"},{"$f":"JAN!F5","v":""},{"$f":"JAN!G5","v":""},{"$f":"JAN!H5","v":"SG or Other"},{"$f":"JAN!I5","v":"Youth Group"},{"$f":"JAN!J5","v":"Conversions"},{"$f":"JAN!K5","v":"Baptisms"},{"$f":"JAN!L5","v":"Growth decisions"},{"$f":"JAN!M5","v":"Members Added"},null,{"$f":"JAN!O5","v":"Worship Service"},{"$f":"JAN!P5","v":""},{"$f":"JAN!Q5","v":""},{"$f":"JAN!R5","v":""},{"$f":"JAN!S5","v":""},{"$f":"JAN!T5","v":""},{"$f":"JAN!U5","v":""},{"$f":"JAN!V5","v":""},{"$f":"JAN!W5","v":""}]
[1,{"$f":"IF(JAN!$O$16=\"no\",SUM(O6:Q6)-W6,SUM(C6:D6))","v":0},{"$f":"IF($C$5=\"Adults\",IF(SUM(O6:Q6)=0,\"\",SUM(O6:Q6)),0)","v":0},{"$f":"IF($D$5=\"CC\",IF(SUM(R6:T6)=0,\"\",SUM(R6:T6)),0)","v":0},null,{"$f":"IF($F$5=\"\",0,\"\")","v":0},{"$f":"IF($G$5=\"\",0,\"\")","v":0},null,{"$f":"IF($I$5=\"Total Youth\",IF(SUM(U6:V6)=0,\"\",SUM(U6:V6)),0)","v":0},null,null,null,null,null,null,{"$f":"IF($P$5=\"\",0,\"\")","v":0},{"$f":"IF($Q$5=\"\",0,\"\")","v":0},{"$f":"IF($R$5=\"\",0,\"\")","v":0},{"$f":"IF($S$5=\"\",0,\"\")","v":0},{"$f":"IF($T$5=\"\",0,\"\")","v":0},null,{"$f":"IF($V$5=\"\",0,\"\")","v":0},{"$f":"IF($W$5=\"\",0,1)","v":0}]
[2,{"$f":"IF(JAN!$O$16=\"no\",SUM(O7:Q7)-W7,SUM(C7:D7))","v":0},{"$f":"IF($C$5=\"Adults\",IF(SUM(O7:Q7)=0,\"\",SUM(O7:Q7)),0)","v":0},{"$f":"IF($D$5=\"CC\",IF(SUM(R7:T7)=0,\"\",SUM(R7:T7)),0)","v":0},null,{"$f":"IF($F$5=\"\",0,\"\")","v":0},{"$f":"IF($G$5=\"\",0,\"\")","v":0},null,{"$f":"IF($I$5=\"Total Youth\",IF(SUM(U7:V7)=0,\"\",SUM(U7:V7)),0)","v":0},null,null,null,null,null,null,{"$f":"IF($P$5=\"\",0,\"\")","v":0},{"$f":"IF($Q$5=\"\",0,\"\")","v":0},{"$f":"IF($R$5=\"\",0,\"\")","v":0},{"$f":"IF($S$5=\"\",0,\"\")","v":0},{"$f":"IF($T$5=\"\",0,\"\")","v":0},null,{"$f":"IF($V$5=\"\",0,\"\")","v":0},{"$f":"IF($W$5=\"\",0,1)","v":0}]
[3,{"$f":"IF(JAN!$O$16=\"no\",SUM(O8:Q8)-W8,SUM(C8:D8))","v":0},{"$f":"IF($C$5=\"Adults\",IF(SUM(O8:Q8)=0,\"\",SUM(O8:Q8)),0)","v":0},{"$f":"IF($D$5=\"CC\",IF(SUM(R8:T8)=0,\"\",SUM(R8:T8)),0)","v":0},null,{"$f":"IF($F$5=\"\",0,\"\")","v":0},{"$f":"IF($G$5=\"\",0,\"\")","v":0},null,{"$f":"IF($I$5=\"Total Youth\",IF(SUM(U8:V8)=0,\"\",SUM(U8:V8)),0)","v":0},null,null,null,null,null,null,{"$f":"IF($P$5=\"\",0,\"\")","v":0},{"$f":"IF($Q$5=\"\",0,\"\")","v":0},{"$f":"IF($R$5=\"\",0,\"\")","v":0},{"$f":"IF($S$5=\"\",0,\"\")","v":0},{"$f":"IF($T$5=\"\",0,\"\")","v":0},null,{"$f":"IF($V$5=\"\",0,\"\")","v":0},{"$f":"IF($W$5=\"\",0,1)","v":0}]
[4,{"$f":"IF(JAN!$O$16=\"no\",SUM(O9:Q9)-W9,SUM(C9:D9))","v":0},{"$f":"IF($C$5=\"Adults\",IF(SUM(O9:Q9)=0,\"\",SUM(O9:Q9)),0)","v":0},{"$f":"IF($D$5=\"CC\",IF(SUM(R9:T9)=0,\"\",SUM(R9:T9)),0)","v":0},null,{"$f":"IF($F$5=\"\",0,\"\")","v":0},{"$f":"IF($G$5=\"\",0,\"\")","v":0},null,{"$f":"IF($I$5=\"Total Youth\",IF(SUM(U9:V9)=0,\"\",SUM(U9:V9)),0)","v":0},null,null,null,null,null,null,{"$f":"IF($P$5=\"\",0,\"\")","v":0},{"$f":"IF($Q$5=\"\",0,\"\")","v":0},{"$f":"IF($R$5=\"\",0,\"\")","v":0},{"$f":"IF($S$5=\"\",0,\"\")","v":0},{"$f":"IF($T$5=\"\",0,\"\")","v":0},null,{"$f":"IF($V$5=\"\",0,\"\")","v":0},{"$f":"IF($W$5=\"\",0,1)","v":0}]
[null,{"$f":"IF(JAN!$O$16=\"no\",SUM(O10:Q10)-W10,SUM(C10:D10))","v":0}]
["Totals",{"$f":"IF(SUM(B6:B10)=0,\"\",SUM(B6:B10))","v":""},{"$f":"IF(SUM(C6:C10)=0,\"\",SUM(C6:C10))","v":""},"","","",{"$f":"IF(SUM(G6:G10)=0,\"\",SUM(G6:G10))","v":""},"","",{"$f":"IF(COUNTA(J6:J10)=0,\"\",SUM(J6:J10))","v":""},{"$f":"IF(COUNTA(K6:K10)=0,\"\",SUM(K6:K10))","v":""},{"$f":"IF(COUNTA(L6:L10)=0,\"\",SUM(L6:L10))","v":""},{"$f":"IF(COUNTA(M6:M10)=0,\"\",SUM(M6:M10))","v":""}]
["Avgs",{"$f":"IF(B11=\"\",\"\",SUM(B6:B10)/COUNTIF(B6:B10,\">0\"))","v":""},"","","","","","",""]
[]
["The most exciting thing that happened this month:",null,null,null,null,null,null,null,null,null,null,null,null,null,"How are you doing with The Ten Commitments?"]
[null,null,null,null,null,null,null,null,null,null,null,null,null,null,"Assess yourself by putting an X in the category that best describes your status"]
[]
[null,null,null,null,null,null,null,null,null,null,null,null,null,null,"The Three Spheres",null,null,"Falling Behind","Holding My Own","Setting the Pace"]
[]
[null,null,null,null,null,null,null,null,null,null,null,null,null,null,"Fit","Physically",null,null,null,null,{"$f":"IF(R19=\"x\",1,IF(S19=\"x\",2,IF(T19=\"X\",3,\"\")))","v":""}]
[null,null,null,null,null,null,null,null,null,null,null,null,null,null,null,"Intellectually",null,null,null,null,{"$f":"IF(R20=\"x\",1,IF(S20=\"x\",2,IF(T20=\"X\",3,\"\")))","v":""}]
[null,null,null,null,null,null,null,null,null,null,null,null,null,null,null,"Relationally",null,null,null,null,""]
["The most challenging issue that is happening:",null,null,null,null,null,null,null,null,null,null,null,null,null,null,"Spiritually",null,null,null,null,""]
[null,null,null,null,null,null,null,null,null,null,null,null,null,null,"Faithful","Marriage",null,null,null,null,""]
[null,null,null,null,null,null,null,null,null,null,null,null,null,null,null,"Parenting",null,null,null,null,""]
[null,null,null,null,null,null,null,null,null,null,null,null,null,null,null,"Ministry",null,null,null,null,""]
[null,null,null,null,null,null,null,null,null,null,null,null,null,null,null,"Finances",null,null,null,null,""]
[null,null,null,null,null,null,null,null,null,null,null,null,null,null,"Fruitful","The Lost",null,null,null,null,""]
[null,null,null,null,null,null,null,null,null,null,null,null,null,null,null,"Other Believers",null,null,null,null,""]
["What I plan to do about it:"]
[]
[]
[]
[]
[]
["Where I see the ministry heading:"]
[]
[]
[]
[]
[]
["Plans to accomplish this (my goals for next month):"]
["1)"]
["2)"]
["3)"]
["4) "]
["5) "]
["Book(s) currently reading or classes taking:"]
["1)"]
["2)"]

{"sheet":"APR","index":4,"n_rows":49,"n_cols":23,"rows_kept":49,"cut":false,"hidden":false,"merged":[[48,1,48,12],[45,1,45,12],[46,0,46,12],[47,1,47,12],[22,15,22,16],[41,1,41,12],[42,1,42,12],[43,1,43,12],[23,15,23,16],[24,15,24,16],[16,19,17,19],[40,0,40,12],[21,15,21,16],[16,14,17,16],[26,14,27,14],[26,15,26,16],[27,15,27,16],[22,14,25,14],[16,18,17,18],[35,0,39,12],[28,0,28,12],[16,17,17,17],[18,15,18,16],[19,15,19,16],[20,15,20,16],[44,1,44,12],[2,1,2,3],[18,14,21,14],[25,15,25,16],[34,0,34,12],[0,3,0,8],[14,0,20,12],[22,0,27,12],[29,0,33,12],[13,0,13,12],[21,0,21,12]]}
[null,null,"Monthly Report on",{"$f":"JAN!D1","v":""},null,null,null,null,null,"Church",null,null,null,null,null,null,null,null,null,null,null,"x"]
[]
["Pastor:",{"$f":"JAN!C3","v":""},null,null,null,null,null,null,null,"For Month of ","APRIL",null,{"$f":"JAN!M3","v":2018}]
[]
["Week",{"$f":"JAN!B5","v":"Worship Attend"},{"$f":"JAN!C5","v":""},{"$f":"JAN!D5","v":""},{"$f":"JAN!E5","v":"Giving"},{"$f":"JAN!F5","v":""},{"$f":"JAN!G5","v":""},{"$f":"JAN!H5","v":"SG or Other"},{"$f":"JAN!I5","v":"Youth Group"},{"$f":"JAN!J5","v":"Conversions"},{"$f":"JAN!K5","v":"Baptisms"},{"$f":"JAN!L5","v":"Growth decisions"},{"$f":"JAN!M5","v":"Members Added"},null,{"$f":"JAN!O5","v":"Worship Service"},{"$f":"JAN!P5","v":""},{"$f":"JAN!Q5","v":""},{"$f":"JAN!R5","v":""},{"$f":"JAN!S5","v":""},{"$f":"JAN!T5","v":""},{"$f":"JAN!U5","v":""},{"$f":"JAN!V5","v":""},{"$f":"JAN!W5","v":""}]
[1,{"$f":"IF(JAN!$O$16=\"no\",SUM(O6:Q6)-W6,SUM(C6:D6))","v":0},{"$f":"IF($C$5=\"Adults\",IF(SUM(O6:Q6)=0,\"\",SUM(O6:Q6)),0)","v":0},{"$f":"IF($D$5=\"CC\",IF(SUM(R6:T6)=0,\"\",SUM(R6:T6)),0)","v":0},null,{"$f":"IF($F$5=\"\",0,\"\")","v":0},{"$f":"IF($G$5=\"\",0,\"\")","v":0},null,{"$f":"IF($I$5=\"Total Youth\",IF(SUM(U6:V6)=0,\"\",SUM(U6:V6)),0)","v":0},null,null,null,null,null,null,{"$f":"IF($P$5=\"\",0,\"\")","v":0},{"$f":"IF($Q$5=\"\",0,\"\")","v":0},{"$f":"IF($R$5=\"\",0,\"\")","v":0},{"$f":"IF($S$5=\"\",0,\"\")","v":0},{"$f":"IF($T$5=\"\",0,\"\")","v":0},null,{"$f":"IF($V$5=\"\",0,\"\")","v":0},{"$f":"IF($W$5=\"\",0,1)","v":0}]
[2,{"$f":"IF(JAN!$O$16=\"no\",SUM(O7:Q7)-W7,SUM(C7:D7))","v":0},{"$f":"IF($C$5=\"Adults\",IF(SUM(O7:Q7)=0,\"\",SUM(O7:Q7)),0)","v":0},{"$f":"IF($D$5=\"CC\",IF(SUM(R7:T7)=0,\"\",SUM(R7:T7)),0)","v":0},null,{"$f":"IF($F$5=\"\",0,\"\")","v":0},{"$f":"IF($G$5=\"\",0,\"\")","v":0},null,{"$f":"IF($I$5=\"Total Youth\",IF(SUM(U7:V7)=0,\"\",SUM(U7:V7)),0)","v":0},null,null,null,null,null,null,{"$f":"IF($P$5=\"\",0,\"\")","v":0},{"$f":"IF($Q$5=\"\",0,\"\")","v":0},{"$f":"IF($R$5=\"\",0,\"\")","v":0},{"$f":"IF($S$5=\"\",0,\"\")","v":0},{"$f":"IF($T$5=\"\",0,\"\")","v":0},null,{"$f":"IF($V$5=\"\",0,\"\")","v":0},{"$f":"IF($W$5=\"\",0,1)","v":0}]
[3,{"$f":"IF(JAN!$O$16=\"no\",SUM(O8:Q8)-W8,SUM(C8:D8))","v":0},{"$f":"IF($C$5=\"Adults\",IF(SUM(O8:Q8)=0,\"\",SUM(O8:Q8)),0)","v":0},{"$f":"IF($D$5=\"CC\",IF(SUM(R8:T8)=0,\"\",SUM(R8:T8)),0)","v":0},null,{"$f":"IF($F$5=\"\",0,\"\")","v":0},{"$f":"IF($G$5=\"\",0,\"\")","v":0},null,{"$f":"IF($I$5=\"Total Youth\",IF(SUM(U8:V8)=0,\"\",SUM(U8:V8)),0)","v":0},null,null,null,null,null,null,{"$f":"IF($P$5=\"\",0,\"\")","v":0},{"$f":"IF($Q$5=\"\",0,\"\")","v":0},{"$f":"IF($R$5=\"\",0,\"\")","v":0},{"$f":"IF($S$5=\"\",0,\"\")","v":0},{"$f":"IF($T$5=\"\",0,\"\")","v":0},null,{"$f":"IF($V$5=\"\",0,\"\")","v":0},{"$f":"IF($W$5=\"\",0,1)","v":0}]
[4,{"$f":"IF(JAN!$O$16=\"no\",SUM(O9:Q9)-W9,SUM(C9:D9))","v":0},{"$f":"IF($C$5=\"Adults\",IF(SUM(O9:Q9)=0,\"\",SUM(O9:Q9)),0)","v":0},{"$f":"IF($D$5=\"CC\",IF(SUM(R9:T9)=0,\"\",SUM(R9:T9)),0)","v":0},null,{"$f":"IF($F$5=\"\",0,\"\")","v":0},{"$f":"IF($G$5=\"\",0,\"\")","v":0},null,{"$f":"IF($I$5=\"Total Youth\",IF(SUM(U9:V9)=0,\"\",SUM(U9:V9)),0)","v":0},null,null,null,null,null,null,{"$f":"IF($P$5=\"\",0,\"\")","v":0},{"$f":"IF($Q$5=\"\",0,\"\")","v":0},{"$f":"IF($R$5=\"\",0,\"\")","v":0},{"$f":"IF($S$5=\"\",0,\"\")","v":0},{"$f":"IF($T$5=\"\",0,\"\")","v":0},null,{"$f":"IF($V$5=\"\",0,\"\")","v":0},{"$f":"IF($W$5=\"\",0,1)","v":0}]
[5,{"$f":"IF(JAN!$O$16=\"no\",SUM(O10:Q10)-W10,SUM(C10:D10))","v":0},{"$f":"IF($C$5=\"Adults\",IF(SUM(O10:Q10)=0,\"\",SUM(O10:Q10)),0)","v":0},{"$f":"IF($D$5=\"CC\",IF(SUM(R10:T10)=0,\"\",SUM(R10:T10)),0)","v":0},null,{"$f":"IF($F$5=\"\",0,\"\")","v":0},{"$f":"IF($G$5=\"\",0,\"\")","v":0},null,{"$f":"IF($I$5=\"Total Youth\",IF(SUM(U10:V10)=0,\"\",SUM(U10:V10)),0)","v":0},null,null,null,null,null,null,{"$f":"IF($P$5=\"\",0,\"\")","v":0},{"$f":"IF($Q$5=\"\",0,\"\")","v":0},{"$f":"IF($R$5=\"\",0,\"\")","v":0},{"$f":"IF($S$5=\"\",0,\"\")","v":0},{"$f":"IF($T$5=\"\",0,\"\")","v":0},null,{"$f":"IF($V$5=\"\",0,\"\")","v":0},{"$f":"IF($W$5=\"\",0,1)","v":0}]
["Totals",{"$f":"IF(SUM(B6:B10)=0,\"\",SUM(B6:B10))","v":""},{"$f":"IF(SUM(C6:C10)=0,\"\",SUM(C6:C10))","v":""},"","","",{"$f":"IF(SUM(G6:G10)=0,\"\",SUM(G6:G10))","v":""},"","",{"$f":"IF(COUNTA(J6:J10)=0,\"\",SUM(J6:J10))","v":""},{"$f":"IF(COUNTA(K6:K10)=0,\"\",SUM(K6:K10))","v":""},{"$f":"IF(COUNTA(L6:L10)=0,\"\",SUM(L6:L10))","v":""},{"$f":"IF(COUNTA(M6:M10)=0,\"\",SUM(M6:M10))","v":""}]
["Avgs",{"$f":"IF(B11=\"\",\"\",SUM(B6:B10)/COUNTIF(B6:B10,\">0\"))","v":""},"","","","","","",""]
[]
["The most exciting thing that happened this month:",null,null,null,null,null,null,null,null,null,null,null,null,null,"How are you doing with The Ten Commitments?"]
[null,null,null,null,null,null,null,null,null,null,null,null,null,null,"Assess yourself by putting an X in the category that best describes your status"]
[]
[null,null,null,null,null,null,null,null,null,null,null,null,null,null,"The Three Spheres",null,null,"Falling Behind","Holding My Own","Setting the Pace"]
[]
[null,null,null,null,null,null,null,null,null,null,null,null,null,null,"Fit","Physically",null,null,null,null,{"$f":"IF(R19=\"x\",1,IF(S19=\"x\",2,IF(T19=\"X\",3,\"\")))","v":""}]
[null,null,null,null,null,null,null,null,null,null,null,null,null,null,null,"Intellectually",null,null,null,null,{"$f":"IF(R20=\"x\",1,IF(S20=\"x\",2,IF(T20=\"X\",3,\"\")))","v":""}]
[null,null,null,null,null,null,null,null,null,null,null,null,null,null,null,"Relationally",null,null,null,null,""]
["The most challenging issue that is happening:",null,null,null,null,null,null,null,null,null,null,null,null,null,null,"Spiritually",null,null,null,null,""]
[null,null,null,null,null,null,null,null,null,null,null,null,null,null,"Faithful","Marriage",null,null,null,null,""]
[null,null,null,null,null,null,null,null,null,null,null,null,null,null,null,"Parenting",null,null,null,null,""]
[null,null,null,null,null,null,null,null,null,null,null,null,null,null,null,"Ministry",null,null,null,null,""]
[null,null,null,null,null,null,null,null,null,null,null,null,null,null,null,"Finances",null,null,null,null,""]
[null,null,null,null,null,null,null,null,null,null,null,null,null,null,"Fruitful","The Lost",null,null,null,null,""]
[null,null,null,null,null,null,null,null,null,null,null,null,null,null,null,"Other Believers",null,null,null,null,""]
["What I plan to do about it:"]
[]
[]
[]
[]
[]
["Where I see the ministry heading:"]
[]
[]
[]
[]
[]
["Plans to accomplish this (my goals for next month):"]
["1)"]
["2)"]
["3)"]
["4) "]
["5) "]
["Book(s) currently reading or classes taking:"]
["1)"]
["2)"]

{"sheet":"MAY","index":5,"n_rows":49,"n_cols":23,"rows_kept":49,"cut":false,"hidden":false,"merged":[[42,1,42,12],[43,1,43,12],[0,3,0,8],[35,0,39,12],[14,0,20,12],[22,0,27,12],[29,0,33,12],[2,1,2,3],[34,0,34,12],[13,0,13,12],[18,14,21,14],[18,15,18,16],[19,15,19,16],[20,15,20,16],[40,0,40,12],[41,1,41,12],[48,1,48,12],[45,1,45,12],[46,0,46,12],[47,1,47,12],[21,15,21,16],[21,0,21,12],[28,0,28,12],[23,15,23,16],[25,15,25,16],[22,15,22,16],[44,1,44,12],[16,18,17,18],[26,14,27,14],[16,19,17,19],[16,17,17,17],[16,14,17,16],[24,15,24,16],[26,15,26,16],[27,15,27,16],[22,14,25,14]]}
[null,null,"Monthly Report on",{"$f":"JAN!D1","v":""},null,null,null,null,null,"Church",null,null,null,null,null,null,null,null,null,null,null,"x"]
[]
["Pastor:",{"$f":"JAN!C3","v":""},null,null,null,null,null,null,null,"For Month of ","MAY",null,{"$f":"JAN!M3","v":2018}]
[]
["Week",{"$f":"JAN!B5","v":"Worship Attend"},{"$f":"JAN!C5","v":""},{"$f":"JAN!D5","v":""},{"$f":"JAN!E5","v":"Giving"},{"$f":"JAN!F5","v":""},{"$f":"JAN!G5","v":""},{"$f":"JAN!H5","v":"SG or Other"},{"$f":"JAN!I5","v":"Youth Group"},{"$f":"JAN!J5","v":"Conversions"},{"$f":"JAN!K5","v":"Baptisms"},{"$f":"JAN!L5","v":"Growth decisions"},{"$f":"JAN!M5","v":"Members Added"},null,{"$f":"JAN!O5","v":"Worship Service"},{"$f":"JAN!P5","v":""},{"$f":"JAN!Q5","v":""},{"$f":"JAN!R5","v":""},{"$f":"JAN!S5","v":""},{"$f":"JAN!T5","v":""},{"$f":"JAN!U5","v":""},{"$f":"JAN!V5","v":""},{"$f":"JAN!W5","v":""}]
[1,{"$f":"IF(JAN!$O$16=\"no\",SUM(O6:Q6)-W6,SUM(C6:D6))","v":0},{"$f":"IF($C$5=\"Adults\",IF(SUM(O6:Q6)=0,\"\",SUM(O6:Q6)),0)","v":0},{"$f":"IF($D$5=\"CC\",IF(SUM(R6:T6)=0,\"\",SUM(R6:T6)),0)","v":0},null,{"$f":"IF($F$5=\"\",0,\"\")","v":0},{"$f":"IF($G$5=\"\",0,\"\")","v":0},null,{"$f":"IF($I$5=\"Total Youth\",IF(SUM(U6:V6)=0,\"\",SUM(U6:V6)),0)","v":0},null,null,null,null,null,null,{"$f":"IF($P$5=\"\",0,\"\")","v":0},{"$f":"IF($Q$5=\"\",0,\"\")","v":0},{"$f":"IF($R$5=\"\",0,\"\")","v":0},{"$f":"IF($S$5=\"\",0,\"\")","v":0},{"$f":"IF($T$5=\"\",0,\"\")","v":0},null,{"$f":"IF($V$5=\"\",0,\"\")","v":0},{"$f":"IF($W$5=\"\",0,1)","v":0}]
[2,{"$f":"IF(JAN!$O$16=\"no\",SUM(O7:Q7)-W7,SUM(C7:D7))","v":0},{"$f":"IF($C$5=\"Adults\",IF(SUM(O7:Q7)=0,\"\",SUM(O7:Q7)),0)","v":0},{"$f":"IF($D$5=\"CC\",IF(SUM(R7:T7)=0,\"\",SUM(R7:T7)),0)","v":0},null,{"$f":"IF($F$5=\"\",0,\"\")","v":0},{"$f":"IF($G$5=\"\",0,\"\")","v":0},null,{"$f":"IF($I$5=\"Total Youth\",IF(SUM(U7:V7)=0,\"\",SUM(U7:V7)),0)","v":0},null,null,null,null,null,null,{"$f":"IF($P$5=\"\",0,\"\")","v":0},{"$f":"IF($Q$5=\"\",0,\"\")","v":0},{"$f":"IF($R$5=\"\",0,\"\")","v":0},{"$f":"IF($S$5=\"\",0,\"\")","v":0},{"$f":"IF($T$5=\"\",0,\"\")","v":0},null,{"$f":"IF($V$5=\"\",0,\"\")","v":0},{"$f":"IF($W$5=\"\",0,1)","v":0}]
[3,{"$f":"IF(JAN!$O$16=\"no\",SUM(O8:Q8)-W8,SUM(C8:D8))","v":0},{"$f":"IF($C$5=\"Adults\",IF(SUM(O8:Q8)=0,\"\",SUM(O8:Q8)),0)","v":0},{"$f":"IF($D$5=\"CC\",IF(SUM(R8:T8)=0,\"\",SUM(R8:T8)),0)","v":0},null,{"$f":"IF($F$5=\"\",0,\"\")","v":0},{"$f":"IF($G$5=\"\",0,\"\")","v":0},null,{"$f":"IF($I$5=\"Total Youth\",IF(SUM(U8:V8)=0,\"\",SUM(U8:V8)),0)","v":0},null,null,null,null,null,null,{"$f":"IF($P$5=\"\",0,\"\")","v":0},{"$f":"IF($Q$5=\"\",0,\"\")","v":0},{"$f":"IF($R$5=\"\",0,\"\")","v":0},{"$f":"IF($S$5=\"\",0,\"\")","v":0},{"$f":"IF($T$5=\"\",0,\"\")","v":0},null,{"$f":"IF($V$5=\"\",0,\"\")","v":0},{"$f":"IF($W$5=\"\",0,1)","v":0}]
[4,{"$f":"IF(JAN!$O$16=\"no\",SUM(O9:Q9)-W9,SUM(C9:D9))","v":0},{"$f":"IF($C$5=\"Adults\",IF(SUM(O9:Q9)=0,\"\",SUM(O9:Q9)),0)","v":0},{"$f":"IF($D$5=\"CC\",IF(SUM(R9:T9)=0,\"\",SUM(R9:T9)),0)","v":0},null,{"$f":"IF($F$5=\"\",0,\"\")","v":0},{"$f":"IF($G$5=\"\",0,\"\")","v":0},null,{"$f":"IF($I$5=\"Total Youth\",IF(SUM(U9:V9)=0,\"\",SUM(U9:V9)),0)","v":0},null,null,null,null,null,null,{"$f":"IF($P$5=\"\",0,\"\")","v":0},{"$f":"IF($Q$5=\"\",0,\"\")","v":0},{"$f":"IF($R$5=\"\",0,\"\")","v":0},{"$f":"IF($S$5=\"\",0,\"\")","v":0},{"$f":"IF($T$5=\"\",0,\"\")","v":0},null,{"$f":"IF($V$5=\"\",0,\"\")","v":0},{"$f":"IF($W$5=\"\",0,1)","v":0}]
[null,{"$f":"IF(JAN!$O$16=\"no\",SUM(O10:Q10)-W10,SUM(C10:D10))","v":0}]
["Totals",{"$f":"IF(SUM(B6:B10)=0,\"\",SUM(B6:B10))","v":""},{"$f":"IF(SUM(C6:C10)=0,\"\",SUM(C6:C10))","v":""},"","","",{"$f":"IF(SUM(G6:G10)=0,\"\",SUM(G6:G10))","v":""},"","",{"$f":"IF(COUNTA(J6:J10)=0,\"\",SUM(J6:J10))","v":""},{"$f":"IF(COUNTA(K6:K10)=0,\"\",SUM(K6:K10))","v":""},{"$f":"IF(COUNTA(L6:L10)=0,\"\",SUM(L6:L10))","v":""},{"$f":"IF(COUNTA(M6:M10)=0,\"\",SUM(M6:M10))","v":""}]
["Avgs",{"$f":"IF(B11=\"\",\"\",SUM(B6:B10)/COUNTIF(B6:B10,\">0\"))","v":""},"","","","","","",""]
[]
["The most exciting thing that happened this month:",null,null,null,null,null,null,null,null,null,null,null,null,null,"How are you doing with The Ten Commitments?"]
[null,null,null,null,null,null,null,null,null,null,null,null,null,null,"Assess yourself by putting an X in the category that best describes your status"]
[]
[null,null,null,null,null,null,null,null,null,null,null,null,null,null,"The Three Spheres",null,null,"Falling Behind","Holding My Own","Setting the Pace"]
[]
[null,null,null,null,null,null,null,null,null,null,null,null,null,null,"Fit","Physically",null,null,null,null,{"$f":"IF(R19=\"x\",1,IF(S19=\"x\",2,IF(T19=\"X\",3,\"\")))","v":""}]
[null,null,null,null,null,null,null,null,null,null,null,null,null,null,null,"Intellectually",null,null,null,null,{"$f":"IF(R20=\"x\",1,IF(S20=\"x\",2,IF(T20=\"X\",3,\"\")))","v":""}]
[null,null,null,null,null,null,null,null,null,null,null,null,null,null,null,"Relationally",null,null,null,null,""]
["The most challenging issue that is happening:",null,null,null,null,null,null,null,null,null,null,null,null,null,null,"Spiritually",null,null,null,null,""]
[null,null,null,null,null,null,null,null,null,null,null,null,null,null,"Faithful","Marriage",null,null,null,null,""]
[null,null,null,null,null,null,null,null,null,null,null,null,null,null,null,"Parenting",null,null,null,null,""]
[null,null,null,null,null,null,null,null,null,null,null,null,null,null,null,"Ministry",null,null,null,null,""]
[null,null,null,null,null,null,null,null,null,null,null,null,null,null,null,"Finances",null,null,null,null,""]
[null,null,null,null,null,null,null,null,null,null,null,null,null,null,"Fruitful","The Lost",null,null,null,null,""]
[null,null,null,null,null,null,null,null,null,null,null,null,null,null,null,"Other Believers",null,null,null,null,""]
["What I plan to do about it:"]
[]
[]
[]
[]
[]
["Where I see the ministry heading:"]
[]
[]
[]
[]
[]
["Plans to accomplish this (my goals for next month):"]
["1)"]
["2)"]
["3)"]
["4) "]
["5) "]
["Book(s) currently reading or classes taking:"]
["1)"]
["2)"]

{"sheet":"JUNE","index":6,"n_rows":49,"n_cols":23,"rows_kept":49,"cut":false,"hidden":false,"merged":[[48,1,48,12],[45,1,45,12],[46,0,46,12],[47,1,47,12],[22,15,22,16],[41,1,41,12],[42,1,42,12],[43,1,43,12],[23,15,23,16],[24,15,24,16],[16,19,17,19],[40,0,40,12],[21,15,21,16],[16,14,17,16],[26,14,27,14],[26,15,26,16],[27,15,27,16],[22,14,25,14],[16,18,17,18],[35,0,39,12],[28,0,28,12],[16,17,17,17],[18,15,18,16],[19,15,19,16],[20,15,20,16],[44,1,44,12],[2,1,2,3],[18,14,21,14],[25,15,25,16],[34,0,34,12],[0,3,0,8],[14,0,20,12],[22,0,27,12],[29,0,33,12],[13,0,13,12],[21,0,21,12]]}
[null,null,"Monthly Report on",{"$f":"JAN!D1","v":""},null,null,null,null,null,"Church",null,null,null,null,null,null,null,null,null,null,null,"x"]
[]
["Pastor:",{"$f":"JAN!C3","v":""},null,null,null,null,null,null,null,"For Month of ","JUNE",null,{"$f":"JAN!M3","v":2018}]
[]
["Week",{"$f":"JAN!B5","v":"Worship Attend"},{"$f":"JAN!C5","v":""},{"$f":"JAN!D5","v":""},{"$f":"JAN!E5","v":"Giving"},{"$f":"JAN!F5","v":""},{"$f":"JAN!G5","v":""},{"$f":"JAN!H5","v":"SG or Other"},{"$f":"JAN!I5","v":"Youth Group"},{"$f":"JAN!J5","v":"Conversions"},{"$f":"JAN!K5","v":"Baptisms"},{"$f":"JAN!L5","v":"Growth decisions"},{"$f":"JAN!M5","v":"Members Added"},null,{"$f":"JAN!O5","v":"Worship Service"},{"$f":"JAN!P5","v":""},{"$f":"JAN!Q5","v":""},{"$f":"JAN!R5","v":""},{"$f":"JAN!S5","v":""},{"$f":"JAN!T5","v":""},{"$f":"JAN!U5","v":""},{"$f":"JAN!V5","v":""},{"$f":"JAN!W5","v":""}]
[1,{"$f":"IF(JAN!$O$16=\"no\",SUM(O6:Q6)-W6,SUM(C6:D6))","v":0},{"$f":"IF($C$5=\"Adults\",IF(SUM(O6:Q6)=0,\"\",SUM(O6:Q6)),0)","v":0},{"$f":"IF($D$5=\"CC\",IF(SUM(R6:T6)=0,\"\",SUM(R6:T6)),0)","v":0},null,{"$f":"IF($F$5=\"\",0,\"\")","v":0},{"$f":"IF($G$5=\"\",0,\"\")","v":0},null,{"$f":"IF($I$5=\"Total Youth\",IF(SUM(U6:V6)=0,\"\",SUM(U6:V6)),0)","v":0},null,null,null,null,null,null,{"$f":"IF($P$5=\"\",0,\"\")","v":0},{"$f":"IF($Q$5=\"\",0,\"\")","v":0},{"$f":"IF($R$5=\"\",0,\"\")","v":0},{"$f":"IF($S$5=\"\",0,\"\")","v":0},{"$f":"IF($T$5=\"\",0,\"\")","v":0},null,{"$f":"IF($V$5=\"\",0,\"\")","v":0},{"$f":"IF($W$5=\"\",0,1)","v":0}]
[2,{"$f":"IF(JAN!$O$16=\"no\",SUM(O7:Q7)-W7,SUM(C7:D7))","v":0},{"$f":"IF($C$5=\"Adults\",IF(SUM(O7:Q7)=0,\"\",SUM(O7:Q7)),0)","v":0},{"$f":"IF($D$5=\"CC\",IF(SUM(R7:T7)=0,\"\",SUM(R7:T7)),0)","v":0},null,{"$f":"IF($F$5=\"\",0,\"\")","v":0},{"$f":"IF($G$5=\"\",0,\"\")","v":0},null,{"$f":"IF($I$5=\"Total Youth\",IF(SUM(U7:V7)=0,\"\",SUM(U7:V7)),0)","v":0},null,null,null,null,null,null,{"$f":"IF($P$5=\"\",0,\"\")","v":0},{"$f":"IF($Q$5=\"\",0,\"\")","v":0},{"$f":"IF($R$5=\"\",0,\"\")","v":0},{"$f":"IF($S$5=\"\",0,\"\")","v":0},{"$f":"IF($T$5=\"\",0,\"\")","v":0},null,{"$f":"IF($V$5=\"\",0,\"\")","v":0},{"$f":"IF($W$5=\"\",0,1)","v":0}]
[3,{"$f":"IF(JAN!$O$16=\"no\",SUM(O8:Q8)-W8,SUM(C8:D8))","v":0},{"$f":"IF($C$5=\"Adults\",IF(SUM(O8:Q8)=0,\"\",SUM(O8:Q8)),0)","v":0},{"$f":"IF($D$5=\"CC\",IF(SUM(R8:T8)=0,\"\",SUM(R8:T8)),0)","v":0},null,{"$f":"IF($F$5=\"\",0,\"\")","v":0},{"$f":"IF($G$5=\"\",0,\"\")","v":0},null,{"$f":"IF($I$5=\"Total Youth\",IF(SUM(U8:V8)=0,\"\",SUM(U8:V8)),0)","v":0},null,null,null,null,null,null,{"$f":"IF($P$5=\"\",0,\"\")","v":0},{"$f":"IF($Q$5=\"\",0,\"\")","v":0},{"$f":"IF($R$5=\"\",0,\"\")","v":0},{"$f":"IF($S$5=\"\",0,\"\")","v":0},{"$f":"IF($T$5=\"\",0,\"\")","v":0},null,{"$f":"IF($V$5=\"\",0,\"\")","v":0},{"$f":"IF($W$5=\"\",0,1)","v":0}]
[4,{"$f":"IF(JAN!$O$16=\"no\",SUM(O9:Q9)-W9,SUM(C9:D9))","v":0},{"$f":"IF($C$5=\"Adults\",IF(SUM(O9:Q9)=0,\"\",SUM(O9:Q9)),0)","v":0},{"$f":"IF($D$5=\"CC\",IF(SUM(R9:T9)=0,\"\",SUM(R9:T9)),0)","v":0},null,{"$f":"IF($F$5=\"\",0,\"\")","v":0},{"$f":"IF($G$5=\"\",0,\"\")","v":0},null,{"$f":"IF($I$5=\"Total Youth\",IF(SUM(U9:V9)=0,\"\",SUM(U9:V9)),0)","v":0},null,null,null,null,null,null,{"$f":"IF($P$5=\"\",0,\"\")","v":0},{"$f":"IF($Q$5=\"\",0,\"\")","v":0},{"$f":"IF($R$5=\"\",0,\"\")","v":0},{"$f":"IF($S$5=\"\",0,\"\")","v":0},{"$f":"IF($T$5=\"\",0,\"\")","v":0},null,{"$f":"IF($V$5=\"\",0,\"\")","v":0},{"$f":"IF($W$5=\"\",0,1)","v":0}]
[null,{"$f":"IF(JAN!$O$16=\"no\",SUM(O10:Q10)-W10,SUM(C10:D10))","v":0}]
["Totals",{"$f":"IF(SUM(B6:B10)=0,\"\",SUM(B6:B10))","v":""},{"$f":"IF(SUM(C6:C10)=0,\"\",SUM(C6:C10))","v":""},"","","",{"$f":"IF(SUM(G6:G10)=0,\"\",SUM(G6:G10))","v":""},"","",{"$f":"IF(COUNTA(J6:J10)=0,\"\",SUM(J6:J10))","v":""},{"$f":"IF(COUNTA(K6:K10)=0,\"\",SUM(K6:K10))","v":""},{"$f":"IF(COUNTA(L6:L10)=0,\"\",SUM(L6:L10))","v":""},{"$f":"IF(COUNTA(M6:M10)=0,\"\",SUM(M6:M10))","v":""}]
["Avgs",{"$f":"IF(B11=\"\",\"\",SUM(B6:B10)/COUNTIF(B6:B10,\">0\"))","v":""},"","","","","","",""]
[]
["The most exciting thing that happened this month:",null,null,null,null,null,null,null,null,null,null,null,null,null,"How are you doing with The Ten Commitments?"]
[null,null,null,null,null,null,null,null,null,null,null,null,null,null,"Assess yourself by putting an X in the category that best describes your status"]
[]
[null,null,null,null,null,null,null,null,null,null,null,null,null,null,"The Three Spheres",null,null,"Falling Behind","Holding My Own","Setting the Pace"]
[]
[null,null,null,null,null,null,null,null,null,null,null,null,null,null,"Fit","Physically",null,null,null,null,{"$f":"IF(R19=\"x\",1,IF(S19=\"x\",2,IF(T19=\"X\",3,\"\")))","v":""}]
[null,null,null,null,null,null,null,null,null,null,null,null,null,null,null,"Intellectually",null,null,null,null,{"$f":"IF(R20=\"x\",1,IF(S20=\"x\",2,IF(T20=\"X\",3,\"\")))","v":""}]
[null,null,null,null,null,null,null,null,null,null,null,null,null,null,null,"Relationally",null,null,null,null,""]
["The most challenging issue that is happening:",null,null,null,null,null,null,null,null,null,null,null,null,null,null,"Spiritually",null,null,null,null,""]
[null,null,null,null,null,null,null,null,null,null,null,null,null,null,"Faithful","Marriage",null,null,null,null,""]
[null,null,null,null,null,null,null,null,null,null,null,null,null,null,null,"Parenting",null,null,null,null,""]
[null,null,null,null,null,null,null,null,null,null,null,null,null,null,null,"Ministry",null,null,null,null,""]
[null,null,null,null,null,null,null,null,null,null,null,null,null,null,null,"Finances",null,null,null,null,""]
[null,null,null,null,null,null,null,null,null,null,null,null,null,null,"Fruitful","The Lost",null,null,null,null,""]
[null,null,null,null,null,null,null,null,null,null,null,null,null,null,null,"Other Believers",null,null,null,null,""]
["What I plan to do about it:"]
[]
[]
[]
[]
[]
["Where I see the ministry heading:"]
[]
[]
[]
[]
[]
["Plans to accomplish this (my goals for next month):"]
["1)"]
["2)"]
["3)"]
["4) "]
["5) "]
["Book(s) currently reading or classes taking:"]
["1)"]
["2)"]

{"sheet":"JULY","index":7,"n_rows":49,"n_cols":23,"rows_kept":49,"cut":false,"hidden":false,"merged":[[42,1,42,12],[43,1,43,12],[0,3,0,8],[35,0,39,12],[14,0,20,12],[22,0,27,12],[29,0,33,12],[2,1,2,3],[34,0,34,12],[13,0,13,12],[18,14,21,14],[18,15,18,16],[19,15,19,16],[20,15,20,16],[40,0,40,12],[41,1,41,12],[48,1,48,12],[45,1,45,12],[46,0,46,12],[47,1,47,12],[21,15,21,16],[21,0,21,12],[28,0,28,12],[23,15,23,16],[25,15,25,16],[22,15,22,16],[44,1,44,12],[16,18,17,18],[26,14,27,14],[16,19,17,19],[16,17,17,17],[16,14,17,16],[24,15,24,16],[26,15,26,16],[27,15,27,16],[22,14,25,14]]}
[null,null,"Monthly Report on",{"$f":"JAN!D1","v":""},null,null,null,null,null,"Church",null,null,null,null,null,null,null,null,null,null,null,"x"]
[]
["Pastor:",{"$f":"JAN!C3","v":""},null,null,null,null,null,null,null,"For Month of ","JULY",null,{"$f":"JAN!M3","v":2018}]
[]
["Week",{"$f":"JAN!B5","v":"Worship Attend"},{"$f":"JAN!C5","v":""},{"$f":"JAN!D5","v":""},{"$f":"JAN!E5","v":"Giving"},{"$f":"JAN!F5","v":""},{"$f":"JAN!G5","v":""},{"$f":"JAN!H5","v":"SG or Other"},{"$f":"JAN!I5","v":"Youth Group"},{"$f":"JAN!J5","v":"Conversions"},{"$f":"JAN!K5","v":"Baptisms"},{"$f":"JAN!L5","v":"Growth decisions"},{"$f":"JAN!M5","v":"Members Added"},null,{"$f":"JAN!O5","v":"Worship Service"},{"$f":"JAN!P5","v":""},{"$f":"JAN!Q5","v":""},{"$f":"JAN!R5","v":""},{"$f":"JAN!S5","v":""},{"$f":"JAN!T5","v":""},{"$f":"JAN!U5","v":""},{"$f":"JAN!V5","v":""},{"$f":"JAN!W5","v":""}]
[1,{"$f":"IF(JAN!$O$16=\"no\",SUM(O6:Q6)-W6,SUM(C6:D6))","v":0},{"$f":"IF($C$5=\"Adults\",IF(SUM(O6:Q6)=0,\"\",SUM(O6:Q6)),0)","v":0},{"$f":"IF($D$5=\"CC\",IF(SUM(R6:T6)=0,\"\",SUM(R6:T6)),0)","v":0},null,{"$f":"IF($F$5=\"\",0,\"\")","v":0},{"$f":"IF($G$5=\"\",0,\"\")","v":0},null,{"$f":"IF($I$5=\"Total Youth\",IF(SUM(U6:V6)=0,\"\",SUM(U6:V6)),0)","v":0},null,null,null,null,null,null,{"$f":"IF($P$5=\"\",0,\"\")","v":0},{"$f":"IF($Q$5=\"\",0,\"\")","v":0},{"$f":"IF($R$5=\"\",0,\"\")","v":0},{"$f":"IF($S$5=\"\",0,\"\")","v":0},{"$f":"IF($T$5=\"\",0,\"\")","v":0},null,{"$f":"IF($V$5=\"\",0,\"\")","v":0},{"$f":"IF($W$5=\"\",0,1)","v":0}]
[2,{"$f":"IF(JAN!$O$16=\"no\",SUM(O7:Q7)-W7,SUM(C7:D7))","v":0},{"$f":"IF($C$5=\"Adults\",IF(SUM(O7:Q7)=0,\"\",SUM(O7:Q7)),0)","v":0},{"$f":"IF($D$5=\"CC\",IF(SUM(R7:T7)=0,\"\",SUM(R7:T7)),0)","v":0},null,{"$f":"IF($F$5=\"\",0,\"\")","v":0},{"$f":"IF($G$5=\"\",0,\"\")","v":0},null,{"$f":"IF($I$5=\"Total Youth\",IF(SUM(U7:V7)=0,\"\",SUM(U7:V7)),0)","v":0},null,null,null,null,null,null,{"$f":"IF($P$5=\"\",0,\"\")","v":0},{"$f":"IF($Q$5=\"\",0,\"\")","v":0},{"$f":"IF($R$5=\"\",0,\"\")","v":0},{"$f":"IF($S$5=\"\",0,\"\")","v":0},{"$f":"IF($T$5=\"\",0,\"\")","v":0},null,{"$f":"IF($V$5=\"\",0,\"\")","v":0},{"$f":"IF($W$5=\"\",0,1)","v":0}]
[3,{"$f":"IF(JAN!$O$16=\"no\",SUM(O8:Q8)-W8,SUM(C8:D8))","v":0},{"$f":"IF($C$5=\"Adults\",IF(SUM(O8:Q8)=0,\"\",SUM(O8:Q8)),0)","v":0},{"$f":"IF($D$5=\"CC\",IF(SUM(R8:T8)=0,\"\",SUM(R8:T8)),0)","v":0},null,{"$f":"IF($F$5=\"\",0,\"\")","v":0},{"$f":"IF($G$5=\"\",0,\"\")","v":0},null,{"$f":"IF($I$5=\"Total Youth\",IF(SUM(U8:V8)=0,\"\",SUM(U8:V8)),0)","v":0},null,null,null,null,null,null,{"$f":"IF($P$5=\"\",0,\"\")","v":0},{"$f":"IF($Q$5=\"\",0,\"\")","v":0},{"$f":"IF($R$5=\"\",0,\"\")","v":0},{"$f":"IF($S$5=\"\",0,\"\")","v":0},{"$f":"IF($T$5=\"\",0,\"\")","v":0},null,{"$f":"IF($V$5=\"\",0,\"\")","v":0},{"$f":"IF($W$5=\"\",0,1)","v":0}]
[4,{"$f":"IF(JAN!$O$16=\"no\",SUM(O9:Q9)-W9,SUM(C9:D9))","v":0},{"$f":"IF($C$5=\"Adults\",IF(SUM(O9:Q9)=0,\"\",SUM(O9:Q9)),0)","v":0},{"$f":"IF($D$5=\"CC\",IF(SUM(R9:T9)=0,\"\",SUM(R9:T9)),0)","v":0},null,{"$f":"IF($F$5=\"\",0,\"\")","v":0},{"$f":"IF($G$5=\"\",0,\"\")","v":0},null,{"$f":"IF($I$5=\"Total Youth\",IF(SUM(U9:V9)=0,\"\",SUM(U9:V9)),0)","v":0},null,null,null,null,null,null,{"$f":"IF($P$5=\"\",0,\"\")","v":0},{"$f":"IF($Q$5=\"\",0,\"\")","v":0},{"$f":"IF($R$5=\"\",0,\"\")","v":0},{"$f":"IF($S$5=\"\",0,\"\")","v":0},{"$f":"IF($T$5=\"\",0,\"\")","v":0},null,{"$f":"IF($V$5=\"\",0,\"\")","v":0},{"$f":"IF($W$5=\"\",0,1)","v":0}]
[5,{"$f":"IF(JAN!$O$16=\"no\",SUM(O10:Q10)-W10,SUM(C10:D10))","v":0},{"$f":"IF($C$5=\"Adults\",IF(SUM(O10:Q10)=0,\"\",SUM(O10:Q10)),0)","v":0},{"$f":"IF($D$5=\"CC\",IF(SUM(R10:T10)=0,\"\",SUM(R10:T10)),0)","v":0},null,{"$f":"IF($F$5=\"\",0,\"\")","v":0},{"$f":"IF($G$5=\"\",0,\"\")","v":0},null,{"$f":"IF($I$5=\"Total Youth\",IF(SUM(U10:V10)=0,\"\",SUM(U10:V10)),0)","v":0},null,null,null,null,null,null,{"$f":"IF($P$5=\"\",0,\"\")","v":0},{"$f":"IF($Q$5=\"\",0,\"\")","v":0},{"$f":"IF($R$5=\"\",0,\"\")","v":0},{"$f":"IF($S$5=\"\",0,\"\")","v":0},{"$f":"IF($T$5=\"\",0,\"\")","v":0},null,{"$f":"IF($V$5=\"\",0,\"\")","v":0},{"$f":"IF($W$5=\"\",0,1)","v":0}]
["Totals",{"$f":"IF(SUM(B6:B10)=0,\"\",SUM(B6:B10))","v":""},{"$f":"IF(SUM(C6:C10)=0,\"\",SUM(C6:C10))","v":""},"","","",{"$f":"IF(SUM(G6:G10)=0,\"\",SUM(G6:G10))","v":""},"","",{"$f":"IF(COUNTA(J6:J10)=0,\"\",SUM(J6:J10))","v":""},{"$f":"IF(COUNTA(K6:K10)=0,\"\",SUM(K6:K10))","v":""},{"$f":"IF(COUNTA(L6:L10)=0,\"\",SUM(L6:L10))","v":""},{"$f":"IF(COUNTA(M6:M10)=0,\"\",SUM(M6:M10))","v":""}]
["Avgs",{"$f":"IF(B11=\"\",\"\",SUM(B6:B10)/COUNTIF(B6:B10,\">0\"))","v":""},"","","","","","",""]
[]
["The most exciting thing that happened this month:",null,null,null,null,null,null,null,null,null,null,null,null,null,"How are you doing with The Ten Commitments?"]
[null,null,null,null,null,null,null,null,null,null,null,null,null,null,"Assess yourself by putting an X in the category that best describes your status"]
[]
[null,null,null,null,null,null,null,null,null,null,null,null,null,null,"The Three Spheres",null,null,"Falling Behind","Holding My Own","Setting the Pace"]
[]
[null,null,null,null,null,null,null,null,null,null,null,null,null,null,"Fit","Physically",null,null,null,null,{"$f":"IF(R19=\"x\",1,IF(S19=\"x\",2,IF(T19=\"X\",3,\"\")))","v":""}]
[null,null,null,null,null,null,null,null,null,null,null,null,null,null,null,"Intellectually",null,null,null,null,{"$f":"IF(R20=\"x\",1,IF(S20=\"x\",2,IF(T20=\"X\",3,\"\")))","v":""}]
[null,null,null,null,null,null,null,null,null,null,null,null,null,null,null,"Relationally",null,null,null,null,""]
["The most challenging issue that is happening:",null,null,null,null,null,null,null,null,null,null,null,null,null,null,"Spiritually",null,null,null,null,""]
[null,null,null,null,null,null,null,null,null,null,null,null,null,null,"Faithful","Marriage",null,null,null,null,""]
[null,null,null,null,null,null,null,null,null,null,null,null,null,null,null,"Parenting",null,null,null,null,""]
[null,null,null,null,null,null,null,null,null,null,null,null,null,null,null,"Ministry",null,null,null,null,""]
[null,null,null,null,null,null,null,null,null,null,null,null,null,null,null,"Finances",null,null,null,null,""]
[null,null,null,null,null,null,null,null,null,null,null,null,null,null,"Fruitful","The Lost",null,null,null,null,""]
[null,null,null,null,null,null,null,null,null,null,null,null,null,null,null,"Other Believers",null,null,null,null,""]
["What I plan to do about it:"]
[]
[]
[]
[]
[]
["Where I see the ministry heading:"]
[]
[]
[]
[]
[]
["Plans to accomplish this (my goals for next month):"]
["1)"]
["2)"]
["3)"]
["4) "]
["5) "]
["Book(s) currently reading or classes taking:"]
["1)"]
["2)"]

{"sheet":"AUG","index":8,"n_rows":50,"n_cols":23,"rows_kept":50,"cut":false,"hidden":false,"merged":[[13,0,13,12],[21,0,21,12],[28,0,28,12],[34,0,34,12],[2,1,2,3],[49,1,49,12],[45,1,45,12],[46,1,46,12],[47,0,47,12],[48,1,48,12],[0,3,0,8],[35,0,39,12],[14,0,20,12],[22,0,27,12],[29,0,33,12],[16,19,17,19],[18,14,21,14],[18,15,18,16],[19,15,19,16],[20,15,20,16],[16,18,17,18],[16,17,17,17],[16,14,17,16],[21,15,21,16],[44,1,44,12],[41,1,41,12],[26,14,27,14],[26,15,26,16],[27,15,27,16],[40,0,40,12],[22,15,22,16],[23,15,23,16],[42,1,42,12],[43,1,43,12],[24,15,24,16],[25,15,25,16],[22,14,25,14]]}
[null,null,"Monthly Report on",{"$f":"JAN!D1","v":""},null,null,null,null,null,"Church",null,null,null,null,null,null,null,null,null,null,null,"x"]
[]
["Pastor:",{"$f":"JAN!C3","v":""},null,null,null,null,null,null,"For Month of ","AUGUST",null,null,{"$f":"JAN!M3","v":2018}]
[]
["Week",{"$f":"JAN!B5","v":"Worship Attend"},{"$f":"JAN!C5","v":""},{"$f":"JAN!D5","v":""},{"$f":"JAN!E5","v":"Giving"},{"$f":"JAN!F5","v":""},{"$f":"JAN!G5","v":""},{"$f":"JAN!H5","v":"SG or Other"},{"$f":"JAN!I5","v":"Youth Group"},{"$f":"JAN!J5","v":"Conversions"},{"$f":"JAN!K5","v":"Baptisms"},{"$f":"JAN!L5","v":"Growth decisions"},{"$f":"JAN!M5","v":"Members Added"},null,{"$f":"JAN!O5","v":"Worship Service"},{"$f":"JAN!P5","v":""},{"$f":"JAN!Q5","v":""},{"$f":"JAN!R5","v":""},{"$f":"JAN!S5","v":""},{"$f":"JAN!T5","v":""},{"$f":"JAN!U5","v":""},{"$f":"JAN!V5","v":""},{"$f":"JAN!W5","v":""}]
[1,{"$f":"IF(JAN!$O$16=\"no\",SUM(O6:Q6)-W6,SUM(C6:D6))","v":0},{"$f":"IF($C$5=\"Adults\",IF(SUM(O6:Q6)=0,\"\",SUM(O6:Q6)),0)","v":0},{"$f":"IF($D$5=\"CC\",IF(SUM(R6:T6)=0,\"\",SUM(R6:T6)),0)","v":0},null,{"$f":"IF($F$5=\"\",0,\"\")","v":0},{"$f":"IF($G$5=\"\",0,\"\")","v":0},null,{"$f":"IF($I$5=\"Total Youth\",IF(SUM(U6:V6)=0,\"\",SUM(U6:V6)),0)","v":0},null,null,null,null,null,null,{"$f":"IF($P$5=\"\",0,\"\")","v":0},{"$f":"IF($Q$5=\"\",0,\"\")","v":0},{"$f":"IF($R$5=\"\",0,\"\")","v":0},{"$f":"IF($S$5=\"\",0,\"\")","v":0},{"$f":"IF($T$5=\"\",0,\"\")","v":0},null,{"$f":"IF($V$5=\"\",0,\"\")","v":0},{"$f":"IF($W$5=\"\",0,1)","v":0}]
[2,{"$f":"IF(JAN!$O$16=\"no\",SUM(O7:Q7)-W7,SUM(C7:D7))","v":0},{"$f":"IF($C$5=\"Adults\",IF(SUM(O7:Q7)=0,\"\",SUM(O7:Q7)),0)","v":0},{"$f":"IF($D$5=\"CC\",IF(SUM(R7:T7)=0,\"\",SUM(R7:T7)),0)","v":0},null,{"$f":"IF($F$5=\"\",0,\"\")","v":0},{"$f":"IF($G$5=\"\",0,\"\")","v":0},null,{"$f":"IF($I$5=\"Total Youth\",IF(SUM(U7:V7)=0,\"\",SUM(U7:V7)),0)","v":0},null,null,null,null,null,null,{"$f":"IF($P$5=\"\",0,\"\")","v":0},{"$f":"IF($Q$5=\"\",0,\"\")","v":0},{"$f":"IF($R$5=\"\",0,\"\")","v":0},{"$f":"IF($S$5=\"\",0,\"\")","v":0},{"$f":"IF($T$5=\"\",0,\"\")","v":0},null,{"$f":"IF($V$5=\"\",0,\"\")","v":0},{"$f":"IF($W$5=\"\",0,1)","v":0}]
[3,{"$f":"IF(JAN!$O$16=\"no\",SUM(O8:Q8)-W8,SUM(C8:D8))","v":0},{"$f":"IF($C$5=\"Adults\",IF(SUM(O8:Q8)=0,\"\",SUM(O8:Q8)),0)","v":0},{"$f":"IF($D$5=\"CC\",IF(SUM(R8:T8)=0,\"\",SUM(R8:T8)),0)","v":0},null,{"$f":"IF($F$5=\"\",0,\"\")","v":0},{"$f":"IF($G$5=\"\",0,\"\")","v":0},null,{"$f":"IF($I$5=\"Total Youth\",IF(SUM(U8:V8)=0,\"\",SUM(U8:V8)),0)","v":0},null,null,null,null,null,null,{"$f":"IF($P$5=\"\",0,\"\")","v":0},{"$f":"IF($Q$5=\"\",0,\"\")","v":0},{"$f":"IF($R$5=\"\",0,\"\")","v":0},{"$f":"IF($S$5=\"\",0,\"\")","v":0},{"$f":"IF($T$5=\"\",0,\"\")","v":0},null,{"$f":"IF($V$5=\"\",0,\"\")","v":0},{"$f":"IF($W$5=\"\",0,1)","v":0}]
[4,{"$f":"IF(JAN!$O$16=\"no\",SUM(O9:Q9)-W9,SUM(C9:D9))","v":0},{"$f":"IF($C$5=\"Adults\",IF(SUM(O9:Q9)=0,\"\",SUM(O9:Q9)),0)","v":0},{"$f":"IF($D$5=\"CC\",IF(SUM(R9:T9)=0,\"\",SUM(R9:T9)),0)","v":0},null,{"$f":"IF($F$5=\"\",0,\"\")","v":0},{"$f":"IF($G$5=\"\",0,\"\")","v":0},null,{"$f":"IF($I$5=\"Total Youth\",IF(SUM(U9:V9)=0,\"\",SUM(U9:V9)),0)","v":0},null,null,null,null,null,null,{"$f":"IF($P$5=\"\",0,\"\")","v":0},{"$f":"IF($Q$5=\"\",0,\"\")","v":0},{"$f":"IF($R$5=\"\",0,\"\")","v":0},{"$f":"IF($S$5=\"\",0,\"\")","v":0},{"$f":"IF($T$5=\"\",0,\"\")","v":0},null,{"$f":"IF($V$5=\"\",0,\"\")","v":0},{"$f":"IF($W$5=\"\",0,1)","v":0}]
[null,{"$f":"IF(JAN!$O$16=\"no\",SUM(O10:Q10)-W10,SUM(C10:D10))","v":0}]
["Totals",{"$f":"IF(SUM(B6:B10)=0,\"\",SUM(B6:B10))","v":""},{"$f":"IF(SUM(C6:C10)=0,\"\",SUM(C6:C10))","v":""},"","","",{"$f":"IF(SUM(G6:G10)=0,\"\",SUM(G6:G10))","v":""},"","",{"$f":"IF(COUNTA(J6:J10)=0,\"\",SUM(J6:J10))","v":""},{"$f":"IF(COUNTA(K6:K10)=0,\"\",SUM(K6:K10))","v":""},{"$f":"IF(COUNTA(L6:L10)=0,\"\",SUM(L6:L10))","v":""},{"$f":"IF(COUNTA(M6:M10)=0,\"\",SUM(M6:M10))","v":""}]
["Avgs",{"$f":"IF(B11=\"\",\"\",SUM(B6:B10)/COUNTIF(B6:B10,\">0\"))","v":""},"","","","","","",""]
[]
["The most exciting thing that happened this month:",null,null,null,null,null,null,null,null,null,null,null,null,null,"How are you doing with The Ten Commitments?"]
[null,null,null,null,null,null,null,null,null,null,null,null,null,null,"Assess yourself by putting an X in the category that best describes your status"]
[]
[null,null,null,null,null,null,null,null,null,null,null,null,null,null,"The Three Spheres",null,null,"Falling Behind","Holding My Own","Setting the Pace"]
[]
[null,null,null,null,null,null,null,null,null,null,null,null,null,null,"Fit","Physically",null,null,null,null,{"$f":"IF(R19=\"x\",1,IF(S19=\"x\",2,IF(T19=\"X\",3,\"\")))","v":""}]
[null,null,null,null,null,null,null,null,null,null,null,null,null,null,null,"Intellectually",null,null,null,null,{"$f":"IF(R20=\"x\",1,IF(S20=\"x\",2,IF(T20=\"X\",3,\"\")))","v":""}]
[null,null,null,null,null,null,null,null,null,null,null,null,null,null,null,"Relationally",null,null,null,null,""]
["The most challenging issue that is happening:",null,null,null,null,null,null,null,null,null,null,null,null,null,null,"Spiritually",null,null,null,null,""]
[null,null,null,null,null,null,null,null,null,null,null,null,null,null,"Faithful","Marriage",null,null,null,null,""]
[null,null,null,null,null,null,null,null,null,null,null,null,null,null,null,"Parenting",null,null,null,null,""]
[null,null,null,null,null,null,null,null,null,null,null,null,null,null,null,"Ministry",null,null,null,null,""]
[null,null,null,null,null,null,null,null,null,null,null,null,null,null,null,"Finances",null,null,null,null,""]
[null,null,null,null,null,null,null,null,null,null,null,null,null,null,"Fruitful","The Lost",null,null,null,null,""]
[null,null,null,null,null,null,null,null,null,null,null,null,null,null,null,"Other Believers",null,null,null,null,""]
["What I plan to do about it:"]
[]
[]
[]
[]
[]
["Where I see the ministry heading:"]
[]
[]
[]
[]
[]
["Plans to accomplish this (my goals for next month):"]
["1)"]
["2)"]
["3)"]
["4) "]
["5) "]
[]
["Book(s) currently reading or classes taking:"]
["1)"]
["2)"]

{"sheet":"SEPT","index":9,"n_rows":49,"n_cols":23,"rows_kept":49,"cut":false,"hidden":false,"merged":[[42,1,42,12],[43,1,43,12],[0,3,0,8],[35,0,39,12],[14,0,20,12],[22,0,27,12],[29,0,33,12],[2,1,2,3],[34,0,34,12],[13,0,13,12],[18,14,21,14],[18,15,18,16],[19,15,19,16],[20,15,20,16],[40,0,40,12],[41,1,41,12],[48,1,48,12],[45,1,45,12],[46,0,46,12],[47,1,47,12],[21,15,21,16],[21,0,21,12],[28,0,28,12],[23,15,23,16],[25,15,25,16],[22,15,22,16],[44,1,44,12],[16,18,17,18],[26,14,27,14],[16,19,17,19],[16,17,17,17],[16,14,17,16],[24,15,24,16],[26,15,26,16],[27,15,27,16],[22,14,25,14]]}
[null,null,"Monthly Report on",{"$f":"JAN!D1","v":""},null,null,null,null,null,"Church",null,null,null,null,null,null,null,null,null,null,null,"x"]
[]
["Pastor:",{"$f":"JAN!C3","v":""},null,null,null,null,null,null,"For Month of ","SEPTEMBER",null,null,{"$f":"JAN!M3","v":2018}]
[]
["Week",{"$f":"JAN!B5","v":"Worship Attend"},{"$f":"JAN!C5","v":""},{"$f":"JAN!D5","v":""},{"$f":"JAN!E5","v":"Giving"},{"$f":"JAN!F5","v":""},{"$f":"JAN!G5","v":""},{"$f":"JAN!H5","v":"SG or Other"},{"$f":"JAN!I5","v":"Youth Group"},{"$f":"JAN!J5","v":"Conversions"},{"$f":"JAN!K5","v":"Baptisms"},{"$f":"JAN!L5","v":"Growth decisions"},{"$f":"JAN!M5","v":"Members Added"},null,{"$f":"JAN!O5","v":"Worship Service"},{"$f":"JAN!P5","v":""},{"$f":"JAN!Q5","v":""},{"$f":"JAN!R5","v":""},{"$f":"JAN!S5","v":""},{"$f":"JAN!T5","v":""},{"$f":"JAN!U5","v":""},{"$f":"JAN!V5","v":""},{"$f":"JAN!W5","v":""}]
[1,{"$f":"IF(JAN!$O$16=\"no\",SUM(O6:Q6)-W6,SUM(C6:D6))","v":0},{"$f":"IF($C$5=\"Adults\",IF(SUM(O6:Q6)=0,\"\",SUM(O6:Q6)),0)","v":0},{"$f":"IF($D$5=\"CC\",IF(SUM(R6:T6)=0,\"\",SUM(R6:T6)),0)","v":0},null,{"$f":"IF($F$5=\"\",0,\"\")","v":0},{"$f":"IF($G$5=\"\",0,\"\")","v":0},null,{"$f":"IF($I$5=\"Total Youth\",IF(SUM(U6:V6)=0,\"\",SUM(U6:V6)),0)","v":0},null,null,null,null,null,null,{"$f":"IF($P$5=\"\",0,\"\")","v":0},{"$f":"IF($Q$5=\"\",0,\"\")","v":0},{"$f":"IF($R$5=\"\",0,\"\")","v":0},{"$f":"IF($S$5=\"\",0,\"\")","v":0},{"$f":"IF($T$5=\"\",0,\"\")","v":0},null,{"$f":"IF($V$5=\"\",0,\"\")","v":0},{"$f":"IF($W$5=\"\",0,1)","v":0}]
[2,{"$f":"IF(JAN!$O$16=\"no\",SUM(O7:Q7)-W7,SUM(C7:D7))","v":0},{"$f":"IF($C$5=\"Adults\",IF(SUM(O7:Q7)=0,\"\",SUM(O7:Q7)),0)","v":0},{"$f":"IF($D$5=\"CC\",IF(SUM(R7:T7)=0,\"\",SUM(R7:T7)),0)","v":0},null,{"$f":"IF($F$5=\"\",0,\"\")","v":0},{"$f":"IF($G$5=\"\",0,\"\")","v":0},null,{"$f":"IF($I$5=\"Total Youth\",IF(SUM(U7:V7)=0,\"\",SUM(U7:V7)),0)","v":0},null,null,null,null,null,null,{"$f":"IF($P$5=\"\",0,\"\")","v":0},{"$f":"IF($Q$5=\"\",0,\"\")","v":0},{"$f":"IF($R$5=\"\",0,\"\")","v":0},{"$f":"IF($S$5=\"\",0,\"\")","v":0},{"$f":"IF($T$5=\"\",0,\"\")","v":0},null,{"$f":"IF($V$5=\"\",0,\"\")","v":0},{"$f":"IF($W$5=\"\",0,1)","v":0}]
[3,{"$f":"IF(JAN!$O$16=\"no\",SUM(O8:Q8)-W8,SUM(C8:D8))","v":0},{"$f":"IF($C$5=\"Adults\",IF(SUM(O8:Q8)=0,\"\",SUM(O8:Q8)),0)","v":0},{"$f":"IF($D$5=\"CC\",IF(SUM(R8:T8)=0,\"\",SUM(R8:T8)),0)","v":0},null,{"$f":"IF($F$5=\"\",0,\"\")","v":0},{"$f":"IF($G$5=\"\",0,\"\")","v":0},null,{"$f":"IF($I$5=\"Total Youth\",IF(SUM(U8:V8)=0,\"\",SUM(U8:V8)),0)","v":0},null,null,null,null,null,null,{"$f":"IF($P$5=\"\",0,\"\")","v":0},{"$f":"IF($Q$5=\"\",0,\"\")","v":0},{"$f":"IF($R$5=\"\",0,\"\")","v":0},{"$f":"IF($S$5=\"\",0,\"\")","v":0},{"$f":"IF($T$5=\"\",0,\"\")","v":0},null,{"$f":"IF($V$5=\"\",0,\"\")","v":0},{"$f":"IF($W$5=\"\",0,1)","v":0}]
[4,{"$f":"IF(JAN!$O$16=\"no\",SUM(O9:Q9)-W9,SUM(C9:D9))","v":0},{"$f":"IF($C$5=\"Adults\",IF(SUM(O9:Q9)=0,\"\",SUM(O9:Q9)),0)","v":0},{"$f":"IF($D$5=\"CC\",IF(SUM(R9:T9)=0,\"\",SUM(R9:T9)),0)","v":0},null,{"$f":"IF($F$5=\"\",0,\"\")","v":0},{"$f":"IF($G$5=\"\",0,\"\")","v":0},null,{"$f":"IF($I$5=\"Total Youth\",IF(SUM(U9:V9)=0,\"\",SUM(U9:V9)),0)","v":0},null,null,null,null,null,null,{"$f":"IF($P$5=\"\",0,\"\")","v":0},{"$f":"IF($Q$5=\"\",0,\"\")","v":0},{"$f":"IF($R$5=\"\",0,\"\")","v":0},{"$f":"IF($S$5=\"\",0,\"\")","v":0},{"$f":"IF($T$5=\"\",0,\"\")","v":0},null,{"$f":"IF($V$5=\"\",0,\"\")","v":0},{"$f":"IF($W$5=\"\",0,1)","v":0}]
[5,{"$f":"IF(JAN!$O$16=\"no\",SUM(O10:Q10)-W10,SUM(C10:D10))","v":0},{"$f":"IF($C$5=\"Adults\",IF(SUM(O10:Q10)=0,\"\",SUM(O10:Q10)),0)","v":0},{"$f":"IF($D$5=\"CC\",IF(SUM(R10:T10)=0,\"\",SUM(R10:T10)),0)","v":0},null,{"$f":"IF($F$5=\"\",0,\"\")","v":0},{"$f":"IF($G$5=\"\",0,\"\")","v":0},null,{"$f":"IF($I$5=\"Total Youth\",IF(SUM(U10:V10)=0,\"\",SUM(U10:V10)),0)","v":0},null,null,null,null,null,null,{"$f":"IF($P$5=\"\",0,\"\")","v":0},{"$f":"IF($Q$5=\"\",0,\"\")","v":0},{"$f":"IF($R$5=\"\",0,\"\")","v":0},{"$f":"IF($S$5=\"\",0,\"\")","v":0},{"$f":"IF($T$5=\"\",0,\"\")","v":0},null,{"$f":"IF($V$5=\"\",0,\"\")","v":0},{"$f":"IF($W$5=\"\",0,1)","v":0}]
["Totals",{"$f":"IF(SUM(B6:B10)=0,\"\",SUM(B6:B10))","v":""},{"$f":"IF(SUM(C6:C10)=0,\"\",SUM(C6:C10))","v":""},"","","",{"$f":"IF(SUM(G6:G10)=0,\"\",SUM(G6:G10))","v":""},"","",{"$f":"IF(COUNTA(J6:J10)=0,\"\",SUM(J6:J10))","v":""},{"$f":"IF(COUNTA(K6:K10)=0,\"\",SUM(K6:K10))","v":""},{"$f":"IF(COUNTA(L6:L10)=0,\"\",SUM(L6:L10))","v":""},{"$f":"IF(COUNTA(M6:M10)=0,\"\",SUM(M6:M10))","v":""}]
["Avgs",{"$f":"IF(B11=\"\",\"\",SUM(B6:B10)/COUNTIF(B6:B10,\">0\"))","v":""},"","","","","","",""]
[]
["The most exciting thing that happened this month:",null,null,null,null,null,null,null,null,null,null,null,null,null,"How are you doing with The Ten Commitments?"]
[null,null,null,null,null,null,null,null,null,null,null,null,null,null,"Assess yourself by putting an X in the category that best describes your status"]
[]
[null,null,null,null,null,null,null,null,null,null,null,null,null,null,"The Three Spheres",null,null,"Falling Behind","Holding My Own","Setting the Pace"]
[]
[null,null,null,null,null,null,null,null,null,null,null,null,null,null,"Fit","Physically",null,null,null,null,{"$f":"IF(R19=\"x\",1,IF(S19=\"x\",2,IF(T19=\"X\",3,\"\")))","v":""}]
[null,null,null,null,null,null,null,null,null,null,null,null,null,null,null,"Intellectually",null,null,null,null,{"$f":"IF(R20=\"x\",1,IF(S20=\"x\",2,IF(T20=\"X\",3,\"\")))","v":""}]
[null,null,null,null,null,null,null,null,null,null,null,null,null,null,null,"Relationally",null,null,null,null,""]
["The most challenging issue that is happening:",null,null,null,null,null,null,null,null,null,null,null,null,null,null,"Spiritually",null,null,null,null,""]
[null,null,null,null,null,null,null,null,null,null,null,null,null,null,"Faithful","Marriage",null,null,null,null,""]
[null,null,null,null,null,null,null,null,null,null,null,null,null,null,null,"Parenting",null,null,null,null,""]
[null,null,null,null,null,null,null,null,null,null,null,null,null,null,null,"Ministry",null,null,null,null,""]
[null,null,null,null,null,null,null,null,null,null,null,null,null,null,null,"Finances",null,null,null,null,""]
[null,null,null,null,null,null,null,null,null,null,null,null,null,null,"Fruitful","The Lost",null,null,null,null,""]
[null,null,null,null,null,null,null,null,null,null,null,null,null,null,null,"Other Believers",null,null,null,null,""]
["What I plan to do about it:"]
[]
[]
[]
[]
[]
["Where I see the ministry heading:"]
[]
[]
[]
[]
[]
["Plans to accomplish this (my goals for next month):"]
["1)"]
["2)"]
["3)"]
["4) "]
["5) "]
["Book(s) currently reading or classes taking:"]
["1)"]
["2)"]

{"sheet":"OCT","index":10,"n_rows":49,"n_cols":23,"rows_kept":49,"cut":false,"hidden":false,"merged":[[48,1,48,12],[45,1,45,12],[46,0,46,12],[47,1,47,12],[22,15,22,16],[41,1,41,12],[42,1,42,12],[43,1,43,12],[23,15,23,16],[24,15,24,16],[16,19,17,19],[40,0,40,12],[21,15,21,16],[16,14,17,16],[26,14,27,14],[26,15,26,16],[27,15,27,16],[22,14,25,14],[16,18,17,18],[35,0,39,12],[28,0,28,12],[16,17,17,17],[18,15,18,16],[19,15,19,16],[20,15,20,16],[44,1,44,12],[2,1,2,3],[18,14,21,14],[25,15,25,16],[34,0,34,12],[0,3,0,8],[14,0,20,12],[22,0,27,12],[29,0,33,12],[13,0,13,12],[21,0,21,12]]}
[null,null,"Monthly Report on",{"$f":"JAN!D1","v":""},null,null,null,null,null,"Church",null,null,null,null,null,null,null,null,null,null,null,"x"]
[]
["Pastor:",{"$f":"JAN!C3","v":""},null,null,null,null,null,null,"For Month of ","OCTOBER",null,null,{"$f":"JAN!M3","v":2018}]
[]
["Week",{"$f":"JAN!B5","v":"Worship Attend"},{"$f":"JAN!C5","v":""},{"$f":"JAN!D5","v":""},{"$f":"JAN!E5","v":"Giving"},{"$f":"JAN!F5","v":""},{"$f":"JAN!G5","v":""},{"$f":"JAN!H5","v":"SG or Other"},{"$f":"JAN!I5","v":"Youth Group"},{"$f":"JAN!J5","v":"Conversions"},{"$f":"JAN!K5","v":"Baptisms"},{"$f":"JAN!L5","v":"Growth decisions"},{"$f":"JAN!M5","v":"Members Added"},null,{"$f":"JAN!O5","v":"Worship Service"},{"$f":"JAN!P5","v":""},{"$f":"JAN!Q5","v":""},{"$f":"JAN!R5","v":""},{"$f":"JAN!S5","v":""},{"$f":"JAN!T5","v":""},{"$f":"JAN!U5","v":""},{"$f":"JAN!V5","v":""},{"$f":"JAN!W5","v":""}]
[1,{"$f":"IF(JAN!$O$16=\"no\",SUM(O6:Q6)-W6,SUM(C6:D6))","v":0},{"$f":"IF($C$5=\"Adults\",IF(SUM(O6:Q6)=0,\"\",SUM(O6:Q6)),0)","v":0},{"$f":"IF($D$5=\"CC\",IF(SUM(R6:T6)=0,\"\",SUM(R6:T6)),0)","v":0},null,{"$f":"IF($F$5=\"\",0,\"\")","v":0},{"$f":"IF($G$5=\"\",0,\"\")","v":0},null,{"$f":"IF($I$5=\"Total Youth\",IF(SUM(U6:V6)=0,\"\",SUM(U6:V6)),0)","v":0},null,null,null,null,null,null,{"$f":"IF($P$5=\"\",0,\"\")","v":0},{"$f":"IF($Q$5=\"\",0,\"\")","v":0},{"$f":"IF($R$5=\"\",0,\"\")","v":0},{"$f":"IF($S$5=\"\",0,\"\")","v":0},{"$f":"IF($T$5=\"\",0,\"\")","v":0},null,{"$f":"IF($V$5=\"\",0,\"\")","v":0},{"$f":"IF($W$5=\"\",0,1)","v":0}]
[2,{"$f":"IF(JAN!$O$16=\"no\",SUM(O7:Q7)-W7,SUM(C7:D7))","v":0},{"$f":"IF($C$5=\"Adults\",IF(SUM(O7:Q7)=0,\"\",SUM(O7:Q7)),0)","v":0},{"$f":"IF($D$5=\"CC\",IF(SUM(R7:T7)=0,\"\",SUM(R7:T7)),0)","v":0},null,{"$f":"IF($F$5=\"\",0,\"\")","v":0},{"$f":"IF($G$5=\"\",0,\"\")","v":0},null,{"$f":"IF($I$5=\"Total Youth\",IF(SUM(U7:V7)=0,\"\",SUM(U7:V7)),0)","v":0},null,null,null,null,null,null,{"$f":"IF($P$5=\"\",0,\"\")","v":0},{"$f":"IF($Q$5=\"\",0,\"\")","v":0},{"$f":"IF($R$5=\"\",0,\"\")","v":0},{"$f":"IF($S$5=\"\",0,\"\")","v":0},{"$f":"IF($T$5=\"\",0,\"\")","v":0},null,{"$f":"IF($V$5=\"\",0,\"\")","v":0},{"$f":"IF($W$5=\"\",0,1)","v":0}]
[3,{"$f":"IF(JAN!$O$16=\"no\",SUM(O8:Q8)-W8,SUM(C8:D8))","v":0},{"$f":"IF($C$5=\"Adults\",IF(SUM(O8:Q8)=0,\"\",SUM(O8:Q8)),0)","v":0},{"$f":"IF($D$5=\"CC\",IF(SUM(R8:T8)=0,\"\",SUM(R8:T8)),0)","v":0},null,{"$f":"IF($F$5=\"\",0,\"\")","v":0},{"$f":"IF($G$5=\"\",0,\"\")","v":0},null,{"$f":"IF($I$5=\"Total Youth\",IF(SUM(U8:V8)=0,\"\",SUM(U8:V8)),0)","v":0},null,null,null,null,null,null,{"$f":"IF($P$5=\"\",0,\"\")","v":0},{"$f":"IF($Q$5=\"\",0,\"\")","v":0},{"$f":"IF($R$5=\"\",0,\"\")","v":0},{"$f":"IF($S$5=\"\",0,\"\")","v":0},{"$f":"IF($T$5=\"\",0,\"\")","v":0},null,{"$f":"IF($V$5=\"\",0,\"\")","v":0},{"$f":"IF($W$5=\"\",0,1)","v":0}]
[4,{"$f":"IF(JAN!$O$16=\"no\",SUM(O9:Q9)-W9,SUM(C9:D9))","v":0},{"$f":"IF($C$5=\"Adults\",IF(SUM(O9:Q9)=0,\"\",SUM(O9:Q9)),0)","v":0},{"$f":"IF($D$5=\"CC\",IF(SUM(R9:T9)=0,\"\",SUM(R9:T9)),0)","v":0},null,{"$f":"IF($F$5=\"\",0,\"\")","v":0},{"$f":"IF($G$5=\"\",0,\"\")","v":0},null,{"$f":"IF($I$5=\"Total Youth\",IF(SUM(U9:V9)=0,\"\",SUM(U9:V9)),0)","v":0},null,null,null,null,null,null,{"$f":"IF($P$5=\"\",0,\"\")","v":0},{"$f":"IF($Q$5=\"\",0,\"\")","v":0},{"$f":"IF($R$5=\"\",0,\"\")","v":0},{"$f":"IF($S$5=\"\",0,\"\")","v":0},{"$f":"IF($T$5=\"\",0,\"\")","v":0},null,{"$f":"IF($V$5=\"\",0,\"\")","v":0},{"$f":"IF($W$5=\"\",0,1)","v":0}]
[]
["Totals",{"$f":"IF(SUM(B6:B10)=0,\"\",SUM(B6:B10))","v":""},{"$f":"IF(SUM(C6:C10)=0,\"\",SUM(C6:C10))","v":""},"","","",{"$f":"IF(SUM(G6:G10)=0,\"\",SUM(G6:G10))","v":""},"","",{"$f":"IF(COUNTA(J6:J10)=0,\"\",SUM(J6:J10))","v":""},{"$f":"IF(COUNTA(K6:K10)=0,\"\",SUM(K6:K10))","v":""},{"$f":"IF(COUNTA(L6:L10)=0,\"\",SUM(L6:L10))","v":""},{"$f":"IF(COUNTA(M6:M10)=0,\"\",SUM(M6:M10))","v":""}]
["Avgs",{"$f":"IF(B11=\"\",\"\",SUM(B6:B10)/COUNTIF(B6:B10,\">0\"))","v":""},"","","","","","",""]
[]
["The most exciting thing that happened this month:",null,null,null,null,null,null,null,null,null,null,null,null,null,"How are you doing with The Ten Commitments?"]
[null,null,null,null,null,null,null,null,null,null,null,null,null,null,"Assess yourself by putting an X in the category that best describes your status"]
[]
[null,null,null,null,null,null,null,null,null,null,null,null,null,null,"The Three Spheres",null,null,"Falling Behind","Holding My Own","Setting the Pace"]
[]
[null,null,null,null,null,null,null,null,null,null,null,null,null,null,"Fit","Physically",null,null,null,null,{"$f":"IF(R19=\"x\",1,IF(S19=\"x\",2,IF(T19=\"X\",3,\"\")))","v":""}]
[null,null,null,null,null,null,null,null,null,null,null,null,null,null,null,"Intellectually",null,null,null,null,{"$f":"IF(R20=\"x\",1,IF(S20=\"x\",2,IF(T20=\"X\",3,\"\")))","v":""}]
[null,null,null,null,null,null,null,null,null,null,null,null,null,null,null,"Relationally",null,null,null,null,""]
["The most challenging issue that is happening:",null,null,null,null,null,null,null,null,null,null,null,null,null,null,"Spiritually",null,null,null,null,""]
[null,null,null,null,null,null,null,null,null,null,null,null,null,null,"Faithful","Marriage",null,null,null,null,""]
[null,null,null,null,null,null,null,null,null,null,null,null,null,null,null,"Parenting",null,null,null,null,""]
[null,null,null,null,null,null,null,null,null,null,null,null,null,null,null,"Ministry",null,null,null,null,""]
[null,null,null,null,null,null,null,null,null,null,null,null,null,null,null,"Finances",null,null,null,null,""]
[null,null,null,null,null,null,null,null,null,null,null,null,null,null,"Fruitful","The Lost",null,null,null,null,""]
[null,null,null,null,null,null,null,null,null,null,null,null,null,null,null,"Other Believers",null,null,null,null,""]
["What I plan to do about it:"]
[]
[]
[]
[]
[]
["Where I see the ministry heading:"]
[]
[]
[]
[]
[]
["Plans to accomplish this (my goals for next month):"]
["1)"]
["2)"]
["3)"]
["4) "]
["5) "]
["Book(s) currently reading or classes taking:"]
["1)"]
["2)"]

{"sheet":"NOV","index":11,"n_rows":49,"n_cols":23,"rows_kept":49,"cut":false,"hidden":false,"merged":[[48,1,48,12],[45,1,45,12],[46,0,46,12],[47,1,47,12],[22,15,22,16],[41,1,41,12],[42,1,42,12],[43,1,43,12],[23,15,23,16],[24,15,24,16],[16,19,17,19],[40,0,40,12],[21,15,21,16],[16,14,17,16],[26,14,27,14],[26,15,26,16],[27,15,27,16],[22,14,25,14],[16,18,17,18],[35,0,39,12],[28,0,28,12],[16,17,17,17],[18,15,18,16],[19,15,19,16],[20,15,20,16],[44,1,44,12],[2,1,2,3],[18,14,21,14],[25,15,25,16],[34,0,34,12],[0,3,0,8],[14,0,20,12],[22,0,27,12],[29,0,33,12],[13,0,13,12],[21,0,21,12]]}
[null,null,"Monthly Report on",{"$f":"JAN!D1","v":""},null,null,null,null,null,"Church",null,null,null,null,null,null,null,null,null,null,null,"x"]
[]
["Pastor:",{"$f":"JAN!C3","v":""},null,null,null,null,null,null,"For Month of ","NOVEMBER",null,null,{"$f":"JAN!M3","v":2018}]
[]
["Week",{"$f":"JAN!B5","v":"Worship Attend"},{"$f":"JAN!C5","v":""},{"$f":"JAN!D5","v":""},{"$f":"JAN!E5","v":"Giving"},{"$f":"JAN!F5","v":""},{"$f":"JAN!G5","v":""},{"$f":"JAN!H5","v":"SG or Other"},{"$f":"JAN!I5","v":"Youth Group"},{"$f":"JAN!J5","v":"Conversions"},{"$f":"JAN!K5","v":"Baptisms"},{"$f":"JAN!L5","v":"Growth decisions"},{"$f":"JAN!M5","v":"Members Added"},null,{"$f":"JAN!O5","v":"Worship Service"},{"$f":"JAN!P5","v":""},{"$f":"JAN!Q5","v":""},{"$f":"JAN!R5","v":""},{"$f":"JAN!S5","v":""},{"$f":"JAN!T5","v":""},{"$f":"JAN!U5","v":""},{"$f":"JAN!V5","v":""},{"$f":"JAN!W5","v":""}]
[1,{"$f":"IF(JAN!$O$16=\"no\",SUM(O6:Q6)-W6,SUM(C6:D6))","v":0},{"$f":"IF($C$5=\"Adults\",IF(SUM(O6:Q6)=0,\"\",SUM(O6:Q6)),0)","v":0},{"$f":"IF($D$5=\"CC\",IF(SUM(R6:T6)=0,\"\",SUM(R6:T6)),0)","v":0},null,{"$f":"IF($F$5=\"\",0,\"\")","v":0},{"$f":"IF($G$5=\"\",0,\"\")","v":0},null,{"$f":"IF($I$5=\"Total Youth\",IF(SUM(U6:V6)=0,\"\",SUM(U6:V6)),0)","v":0},null,null,null,null,null,null,{"$f":"IF($P$5=\"\",0,\"\")","v":0},{"$f":"IF($Q$5=\"\",0,\"\")","v":0},{"$f":"IF($R$5=\"\",0,\"\")","v":0},{"$f":"IF($S$5=\"\",0,\"\")","v":0},{"$f":"IF($T$5=\"\",0,\"\")","v":0},null,{"$f":"IF($V$5=\"\",0,\"\")","v":0},{"$f":"IF($W$5=\"\",0,1)","v":0}]
[2,{"$f":"IF(JAN!$O$16=\"no\",SUM(O7:Q7)-W7,SUM(C7:D7))","v":0},{"$f":"IF($C$5=\"Adults\",IF(SUM(O7:Q7)=0,\"\",SUM(O7:Q7)),0)","v":0},{"$f":"IF($D$5=\"CC\",IF(SUM(R7:T7)=0,\"\",SUM(R7:T7)),0)","v":0},null,{"$f":"IF($F$5=\"\",0,\"\")","v":0},{"$f":"IF($G$5=\"\",0,\"\")","v":0},null,{"$f":"IF($I$5=\"Total Youth\",IF(SUM(U7:V7)=0,\"\",SUM(U7:V7)),0)","v":0},null,null,null,null,null,null,{"$f":"IF($P$5=\"\",0,\"\")","v":0},{"$f":"IF($Q$5=\"\",0,\"\")","v":0},{"$f":"IF($R$5=\"\",0,\"\")","v":0},{"$f":"IF($S$5=\"\",0,\"\")","v":0},{"$f":"IF($T$5=\"\",0,\"\")","v":0},null,{"$f":"IF($V$5=\"\",0,\"\")","v":0},{"$f":"IF($W$5=\"\",0,1)","v":0}]
[3,{"$f":"IF(JAN!$O$16=\"no\",SUM(O8:Q8)-W8,SUM(C8:D8))","v":0},{"$f":"IF($C$5=\"Adults\",IF(SUM(O8:Q8)=0,\"\",SUM(O8:Q8)),0)","v":0},{"$f":"IF($D$5=\"CC\",IF(SUM(R8:T8)=0,\"\",SUM(R8:T8)),0)","v":0},null,{"$f":"IF($F$5=\"\",0,\"\")","v":0},{"$f":"IF($G$5=\"\",0,\"\")","v":0},null,{"$f":"IF($I$5=\"Total Youth\",IF(SUM(U8:V8)=0,\"\",SUM(U8:V8)),0)","v":0},null,null,null,null,null,null,{"$f":"IF($P$5=\"\",0,\"\")","v":0},{"$f":"IF($Q$5=\"\",0,\"\")","v":0},{"$f":"IF($R$5=\"\",0,\"\")","v":0},{"$f":"IF($S$5=\"\",0,\"\")","v":0},{"$f":"IF($T$5=\"\",0,\"\")","v":0},null,{"$f":"IF($V$5=\"\",0,\"\")","v":0},{"$f":"IF($W$5=\"\",0,1)","v":0}]
[4,{"$f":"IF(JAN!$O$16=\"no\",SUM(O9:Q9)-W9,SUM(C9:D9))","v":0},{"$f":"IF($C$5=\"Adults\",IF(SUM(O9:Q9)=0,\"\",SUM(O9:Q9)),0)","v":0},{"$f":"IF($D$5=\"CC\",IF(SUM(R9:T9)=0,\"\",SUM(R9:T9)),0)","v":0},null,{"$f":"IF($F$5=\"\",0,\"\")","v":0},{"$f":"IF($G$5=\"\",0,\"\")","v":0},null,{"$f":"IF($I$5=\"Total Youth\",IF(SUM(U9:V9)=0,\"\",SUM(U9:V9)),0)","v":0},null,null,null,null,null,null,{"$f":"IF($P$5=\"\",0,\"\")","v":0},{"$f":"IF($Q$5=\"\",0,\"\")","v":0},{"$f":"IF($R$5=\"\",0,\"\")","v":0},{"$f":"IF($S$5=\"\",0,\"\")","v":0},{"$f":"IF($T$5=\"\",0,\"\")","v":0},null,{"$f":"IF($V$5=\"\",0,\"\")","v":0},{"$f":"IF($W$5=\"\",0,1)","v":0}]
[null,{"$f":"IF(JAN!$O$16=\"no\",SUM(O10:Q10)-W10,SUM(C10:D10))","v":0}]
["Totals",{"$f":"IF(SUM(B6:B10)=0,\"\",SUM(B6:B10))","v":""},{"$f":"IF(SUM(C6:C10)=0,\"\",SUM(C6:C10))","v":""},"","","",{"$f":"IF(SUM(G6:G10)=0,\"\",SUM(G6:G10))","v":""},"","",{"$f":"IF(COUNTA(J6:J10)=0,\"\",SUM(J6:J10))","v":""},{"$f":"IF(COUNTA(K6:K10)=0,\"\",SUM(K6:K10))","v":""},{"$f":"IF(COUNTA(L6:L10)=0,\"\",SUM(L6:L10))","v":""},{"$f":"IF(COUNTA(M6:M10)=0,\"\",SUM(M6:M10))","v":""}]
["Avgs",{"$f":"IF(B11=\"\",\"\",SUM(B6:B10)/COUNTIF(B6:B10,\">0\"))","v":""},"","","","","","",""]
[]
["The most exciting thing that happened this month:",null,null,null,null,null,null,null,null,null,null,null,null,null,"How are you doing with The Ten Commitments?"]
[null,null,null,null,null,null,null,null,null,null,null,null,null,null,"Assess yourself by putting an X in the category that best describes your status"]
[]
[null,null,null,null,null,null,null,null,null,null,null,null,null,null,"The Three Spheres",null,null,"Falling Behind","Holding My Own","Setting the Pace"]
[]
[null,null,null,null,null,null,null,null,null,null,null,null,null,null,"Fit","Physically",null,null,null,null,{"$f":"IF(R19=\"x\",1,IF(S19=\"x\",2,IF(T19=\"X\",3,\"\")))","v":""}]
[null,null,null,null,null,null,null,null,null,null,null,null,null,null,null,"Intellectually",null,null,null,null,{"$f":"IF(R20=\"x\",1,IF(S20=\"x\",2,IF(T20=\"X\",3,\"\")))","v":""}]
[null,null,null,null,null,null,null,null,null,null,null,null,null,null,null,"Relationally",null,null,null,null,""]
["The most challenging issue that is happening:",null,null,null,null,null,null,null,null,null,null,null,null,null,null,"Spiritually",null,null,null,null,""]
[null,null,null,null,null,null,null,null,null,null,null,null,null,null,"Faithful","Marriage",null,null,null,null,""]
[null,null,null,null,null,null,null,null,null,null,null,null,null,null,null,"Parenting",null,null,null,null,""]
[null,null,null,null,null,null,null,null,null,null,null,null,null,null,null,"Ministry",null,null,null,null,""]
[null,null,null,null,null,null,null,null,null,null,null,null,null,null,null,"Finances",null,null,null,null,""]
[null,null,null,null,null,null,null,null,null,null,null,null,null,null,"Fruitful","The Lost",null,null,null,null,""]
[null,null,null,null,null,null,null,null,null,null,null,null,null,null,null,"Other Believers",null,null,null,null,""]
["What I plan to do about it:"]
[]
[]
[]
[]
[]
["Where I see the ministry heading:"]
[]
[]
[]
[]
[]
["Plans to accomplish this (my goals for next month):"]
["1)"]
["2)"]
["3)"]
["4) "]
["5) "]
["Book(s) currently reading or classes taking:"]
["1)"]
["2)"]

{"sheet":"DEC","index":12,"n_rows":49,"n_cols":23,"rows_kept":49,"cut":false,"hidden":false,"merged":[[16,18,17,18],[16,19,17,19],[16,14,17,16],[16,17,17,17],[21,15,21,16],[22,15,22,16],[22,14,25,14],[18,15,18,16],[19,15,19,16],[20,15,20,16],[18,14,21,14],[25,15,25,16],[23,15,23,16],[24,15,24,16],[0,3,0,8],[13,0,13,12],[2,1,2,3],[14,0,20,12],[21,0,21,12],[22,0,27,12],[48,1,48,12],[45,1,45,12],[46,0,46,12],[47,1,47,12],[44,1,44,12],[40,0,40,12],[41,1,41,12],[42,1,42,12],[43,1,43,12],[27,15,27,16],[34,0,34,12],[26,14,27,14],[26,15,26,16],[29,0,33,12],[28,0,28,12],[35,0,39,12]]}
[null,null,"Monthly Report on",{"$f":"JAN!D1","v":""},null,null,null,null,null,"Church",null,null,null,null,null,null,null,null,null,null,null,"x"]
[]
["Pastor:",{"$f":"JAN!C3","v":""},null,null,null,null,null,null,"For Month of ","DECEMBER",null,null,{"$f":"JAN!M3","v":2018}]
[]
["Week",{"$f":"JAN!B5","v":"Worship Attend"},{"$f":"JAN!C5","v":""},{"$f":"JAN!D5","v":""},{"$f":"JAN!E5","v":"Giving"},{"$f":"JAN!F5","v":""},{"$f":"JAN!G5","v":""},{"$f":"JAN!H5","v":"SG or Other"},{"$f":"JAN!I5","v":"Youth Group"},{"$f":"JAN!J5","v":"Conversions"},{"$f":"JAN!K5","v":"Baptisms"},{"$f":"JAN!L5","v":"Growth decisions"},{"$f":"JAN!M5","v":"Members Added"},null,{"$f":"JAN!O5","v":"Worship Service"},{"$f":"JAN!P5","v":""},{"$f":"JAN!Q5","v":""},{"$f":"JAN!R5","v":""},{"$f":"JAN!S5","v":""},{"$f":"JAN!T5","v":""},{"$f":"JAN!U5","v":""},{"$f":"JAN!V5","v":""},{"$f":"JAN!W5","v":""}]
[1,{"$f":"IF(JAN!$O$16=\"no\",SUM(O6:Q6)-W6,SUM(C6:D6))","v":0},{"$f":"IF($C$5=\"Adults\",IF(SUM(O6:Q6)=0,\"\",SUM(O6:Q6)),0)","v":0},{"$f":"IF($D$5=\"CC\",IF(SUM(R6:T6)=0,\"\",SUM(R6:T6)),0)","v":0},null,{"$f":"IF($F$5=\"\",0,\"\")","v":0},{"$f":"IF($G$5=\"\",0,\"\")","v":0},null,{"$f":"IF($I$5=\"Total Youth\",IF(SUM(U6:V6)=0,\"\",SUM(U6:V6)),0)","v":0},null,null,null,null,null,null,{"$f":"IF($P$5=\"\",0,\"\")","v":0},{"$f":"IF($Q$5=\"\",0,\"\")","v":0},{"$f":"IF($R$5=\"\",0,\"\")","v":0},{"$f":"IF($S$5=\"\",0,\"\")","v":0},{"$f":"IF($T$5=\"\",0,\"\")","v":0},null,{"$f":"IF($V$5=\"\",0,\"\")","v":0},{"$f":"IF($W$5=\"\",0,1)","v":0}]
[2,{"$f":"IF(JAN!$O$16=\"no\",SUM(O7:Q7)-W7,SUM(C7:D7))","v":0},{"$f":"IF($C$5=\"Adults\",IF(SUM(O7:Q7)=0,\"\",SUM(O7:Q7)),0)","v":0},{"$f":"IF($D$5=\"CC\",IF(SUM(R7:T7)=0,\"\",SUM(R7:T7)),0)","v":0},null,{"$f":"IF($F$5=\"\",0,\"\")","v":0},{"$f":"IF($G$5=\"\",0,\"\")","v":0},null,{"$f":"IF($I$5=\"Total Youth\",IF(SUM(U7:V7)=0,\"\",SUM(U7:V7)),0)","v":0},null,null,null,null,null,null,{"$f":"IF($P$5=\"\",0,\"\")","v":0},{"$f":"IF($Q$5=\"\",0,\"\")","v":0},{"$f":"IF($R$5=\"\",0,\"\")","v":0},{"$f":"IF($S$5=\"\",0,\"\")","v":0},{"$f":"IF($T$5=\"\",0,\"\")","v":0},null,{"$f":"IF($V$5=\"\",0,\"\")","v":0},{"$f":"IF($W$5=\"\",0,1)","v":0}]
[3,{"$f":"IF(JAN!$O$16=\"no\",SUM(O8:Q8)-W8,SUM(C8:D8))","v":0},{"$f":"IF($C$5=\"Adults\",IF(SUM(O8:Q8)=0,\"\",SUM(O8:Q8)),0)","v":0},{"$f":"IF($D$5=\"CC\",IF(SUM(R8:T8)=0,\"\",SUM(R8:T8)),0)","v":0},null,{"$f":"IF($F$5=\"\",0,\"\")","v":0},{"$f":"IF($G$5=\"\",0,\"\")","v":0},null,{"$f":"IF($I$5=\"Total Youth\",IF(SUM(U8:V8)=0,\"\",SUM(U8:V8)),0)","v":0},null,null,null,null,null,null,{"$f":"IF($P$5=\"\",0,\"\")","v":0},{"$f":"IF($Q$5=\"\",0,\"\")","v":0},{"$f":"IF($R$5=\"\",0,\"\")","v":0},{"$f":"IF($S$5=\"\",0,\"\")","v":0},{"$f":"IF($T$5=\"\",0,\"\")","v":0},null,{"$f":"IF($V$5=\"\",0,\"\")","v":0},{"$f":"IF($W$5=\"\",0,1)","v":0}]
[4,{"$f":"IF(JAN!$O$16=\"no\",SUM(O9:Q9)-W9,SUM(C9:D9))","v":0},{"$f":"IF($C$5=\"Adults\",IF(SUM(O9:Q9)=0,\"\",SUM(O9:Q9)),0)","v":0},{"$f":"IF($D$5=\"CC\",IF(SUM(R9:T9)=0,\"\",SUM(R9:T9)),0)","v":0},null,{"$f":"IF($F$5=\"\",0,\"\")","v":0},{"$f":"IF($G$5=\"\",0,\"\")","v":0},null,{"$f":"IF($I$5=\"Total Youth\",IF(SUM(U9:V9)=0,\"\",SUM(U9:V9)),0)","v":0},null,null,null,null,null,null,{"$f":"IF($P$5=\"\",0,\"\")","v":0},{"$f":"IF($Q$5=\"\",0,\"\")","v":0},{"$f":"IF($R$5=\"\",0,\"\")","v":0},{"$f":"IF($S$5=\"\",0,\"\")","v":0},{"$f":"IF($T$5=\"\",0,\"\")","v":0},null,{"$f":"IF($V$5=\"\",0,\"\")","v":0},{"$f":"IF($W$5=\"\",0,1)","v":0}]
[5,{"$f":"IF(JAN!$O$16=\"no\",SUM(O10:Q10)-W10,SUM(C10:D10))","v":0},{"$f":"IF($C$5=\"Adults\",IF(SUM(O10:Q10)=0,\"\",SUM(O10:Q10)),0)","v":0},{"$f":"IF($D$5=\"CC\",IF(SUM(R10:T10)=0,\"\",SUM(R10:T10)),0)","v":0},null,{"$f":"IF($F$5=\"\",0,\"\")","v":0},{"$f":"IF($G$5=\"\",0,\"\")","v":0},null,{"$f":"IF($I$5=\"Total Youth\",IF(SUM(U10:V10)=0,\"\",SUM(U10:V10)),0)","v":0},null,null,null,null,null,null,{"$f":"IF($P$5=\"\",0,\"\")","v":0},{"$f":"IF($Q$5=\"\",0,\"\")","v":0},{"$f":"IF($R$5=\"\",0,\"\")","v":0},{"$f":"IF($S$5=\"\",0,\"\")","v":0},{"$f":"IF($T$5=\"\",0,\"\")","v":0},null,{"$f":"IF($V$5=\"\",0,\"\")","v":0},{"$f":"IF($W$5=\"\",0,1)","v":0}]
["Totals",{"$f":"IF(SUM(B6:B10)=0,\"\",SUM(B6:B10))","v":""},{"$f":"IF(SUM(C6:C10)=0,\"\",SUM(C6:C10))","v":""},"","","",{"$f":"IF(SUM(G6:G10)=0,\"\",SUM(G6:G10))","v":""},"","",{"$f":"IF(COUNTA(J6:J10)=0,\"\",SUM(J6:J10))","v":""},{"$f":"IF(COUNTA(K6:K10)=0,\"\",SUM(K6:K10))","v":""},{"$f":"IF(COUNTA(L6:L10)=0,\"\",SUM(L6:L10))","v":""},{"$f":"IF(COUNTA(M6:M10)=0,\"\",SUM(M6:M10))","v":""}]
["Avgs",{"$f":"IF(B11=\"\",\"\",SUM(B6:B10)/COUNTIF(B6:B10,\">0\"))","v":""},"","","","","","",""]
[]
["The most exciting thing that happened this month:",null,null,null,null,null,null,null,null,null,null,null,null,null,"How are you doing with The Ten Commitments?"]
[null,null,null,null,null,null,null,null,null,null,null,null,null,null,"Assess yourself by putting an X in the category that best describes your status"]
[]
[null,null,null,null,null,null,null,null,null,null,null,null,null,null,"The Three Spheres",null,null,"Falling Behind","Holding My Own","Setting the Pace"]
[]
[null,null,null,null,null,null,null,null,null,null,null,null,null,null,"Fit","Physically",null,null,null,null,{"$f":"IF(R19=\"x\",1,IF(S19=\"x\",2,IF(T19=\"X\",3,\"\")))","v":""}]
[null,null,null,null,null,null,null,null,null,null,null,null,null,null,null,"Intellectually",null,null,null,null,{"$f":"IF(R20=\"x\",1,IF(S20=\"x\",2,IF(T20=\"X\",3,\"\")))","v":""}]
[null,null,null,null,null,null,null,null,null,null,null,null,null,null,null,"Relationally",null,null,null,null,""]
["The most challenging issue that is happening:",null,null,null,null,null,null,null,null,null,null,null,null,null,null,"Spiritually",null,null,null,null,""]
[null,null,null,null,null,null,null,null,null,null,null,null,null,null,"Faithful","Marriage",null,null,null,null,""]
[null,null,null,null,null,null,null,null,null,null,null,null,null,null,null,"Parenting",null,null,null,null,""]
[null,null,null,null,null,null,null,null,null,null,null,null,null,null,null,"Ministry",null,null,null,null,""]
[null,null,null,null,null,null,null,null,null,null,null,null,null,null,null,"Finances",null,null,null,null,""]
[null,null,null,null,null,null,null,null,null,null,null,null,null,null,"Fruitful","The Lost",null,null,null,null,""]
[null,null,null,null,null,null,null,null,null,null,null,null,null,null,null,"Other Believers",null,null,null,null,""]
["What I plan to do about it:"]
[]
[]
[]
[]
[]
["Where I see the ministry heading:"]
[]
[]
[]
[]
[]
["Plans to accomplish this (my goals for next month):"]
["1)"]
["2)"]
["3)"]
["4) "]
["5) "]
["Book(s) currently reading or classes taking:"]
["1)"]
["2)"]

{"sheet":"OVERALL","index":13,"n_rows":94,"n_cols":23,"rows_kept":94,"cut":false,"hidden":false,"merged":[[80,1,80,13],[24,1,24,13],[0,1,0,13],[26,0,29,0],[30,0,33,0],[34,0,37,0],[1,5,1,10],[2,3,2,6],[47,0,50,0],[51,0,55,0],[43,0,46,0],[38,0,42,0],[73,0,77,0],[56,0,59,0],[65,0,68,0],[60,0,64,0],[69,0,72,0]]}
[null,"ANNUAL SUMMARY REPORT"]
[null,null,null,null,{"$f":"JAN!C1","v":"Monthly Report on"},{"$f":"JAN!D1","v":""},null,null,null,null,null,"Church"]
[null,null,"Pastor:",{"$f":"JAN!C3","v":""},null,null,null,null,null,null,null,"For Year",{"$f":"JAN!M3","v":2018}]
[]
[null,"Week",{"$f":"JAN!B5","v":"Worship Attend"},{"$f":"JAN!C5","v":""},{"$f":"JAN!D5","v":""},{"$f":"JAN!E5","v":"Giving"},{"$f":"JAN!F5","v":""},{"$f":"JAN!G5","v":""},{"$f":"JAN!H5","v":"SG or Other"},{"$f":"JAN!I5","v":"Youth Group"},{"$f":"JAN!J5","v":"Conversions"},{"$f":"JAN!K5","v":"Baptisms"},{"$f":"JAN!L5","v":"Growth decisions"},{"$f":"JAN!M5","v":"Members Added"},null,{"$f":"JAN!O5","v":"Worship Service"},{"$f":"JAN!P5","v":""},{"$f":"JAN!Q5","v":""},{"$f":"JAN!R5","v":""},{"$f":"JAN!S5","v":""},{"$f":"JAN!T5","v":""},{"$f":"JAN!U5","v":""},{"$f":"JAN!V5","v":""}]
[null,"Totals",{"$f":"IF(SUM(C27:C78)=0,\"\",SUM(C27:C78))","v":""},{"$f":"IF(SUM(D27:D78)=0,\"\",SUM(D27:D78))","v":""},{"$f":"SUM(E27:E78)","v":0},0,0,{"$f":"SUM(H27:H78)","v":0},0,0,{"$f":"SUM(K27:K78)","v":0},0,0,0,null,0,0,0,0,0,0,0,0]
[null,"Average",{"$f":"IF(C6=\"\",\"\",(SUM(C27:C78)/COUNTIF(C27:C78,\">0\")))","v":""},{"$f":"IF(D6=\"\",\"\",(SUM(D27:D78)/COUNTIF(D27:D78,\">0\")))","v":""},{"$f":"IF(E6=0,\"\",(SUM(E27:E78)/COUNTIF(E27:E78,\">0\")))","v":""},"","","","","",null,null,null,null,null,{"$f":"IF(P6=0,\"\",(SUM(P27:P78)/COUNTIF(P27:P78,\">0\")))","v":""},"","","","","","",""]
[]
[]
[]
[]
[]
[]
[]
[]
[]
[]
[]
[]
[]
[]
[]
[]
[]
[null,"WEEKLY DATA"]
[null,{"$f":"B5","v":"Week"},{"$f":"C5","v":"Worship Attend"},"","","Giving","","","SG or Other","Youth Group","Conversions","Baptisms","Growth decisions","Members Added",null,{"$f":"P5","v":"Worship Service"},{"$f":"Q5","v":""},"","","","","",""]
["JAN",1,{"$f":"IF(JAN!B6=\"\",\"\",JAN!B6)","v":0},{"$f":"IF(JAN!C6=\"\",\"\",JAN!C6)","v":0},{"$f":"IF(JAN!D6=\"\",\"\",JAN!D6)","v":0},{"$f":"IF(JAN!E6=\"\",\"\",JAN!E6)","v":""},{"$f":"IF(JAN!F6=\"\",\"\",JAN!F6)","v":0},{"$f":"IF(JAN!G6=\"\",\"\",JAN!G6)","v":0},{"$f":"IF(JAN!H6=\"\",\"\",JAN!H6)","v":""},{"$f":"IF(JAN!I6=\"\",\"\",JAN!I6)","v":0},{"$f":"IF(JAN!J6=\"\",\"\",JAN!J6)","v":""},{"$f":"IF(JAN!K6=\"\",\"\",JAN!K6)","v":""},{"$f":"IF(JAN!L6=\"\",\"\",JAN!L6)","v":""},{"$f":"IF(JAN!M6=\"\",\"\",JAN!M6)","v":""},{"$f":"IF(JAN!N6=\"\",\"\",JAN!N6)","v":""},{"$f":"IF(JAN!O6=\"\",\"\",JAN!O6)","v":""},{"$f":"IF(JAN!P6=\"\",\"\",JAN!P6)","v":0},{"$f":"IF(JAN!Q6=\"\",\"\",JAN!Q6)","v":0},{"$f":"IF(JAN!R6=\"\",\"\",JAN!R6)","v":0},{"$f":"IF(JAN!S6=\"\",\"\",JAN!S6)","v":0},{"$f":"IF(JAN!T6=\"\",\"\",JAN!T6)","v":0},{"$f":"IF(JAN!U6=\"\",\"\",JAN!U6)","v":0},{"$f":"IF(JAN!V6=\"\",\"\",JAN!V6)","v":0}]
[null,2,{"$f":"IF(JAN!B7=\"\",\"\",JAN!B7)","v":0},{"$f":"IF(JAN!C7=\"\",\"\",JAN!C7)","v":0},{"$f":"IF(JAN!D7=\"\",\"\",JAN!D7)","v":0},{"$f":"IF(JAN!E7=\"\",\"\",JAN!E7)","v":""},{"$f":"IF(JAN!F7=\"\",\"\",JAN!F7)","v":0},{"$f":"IF(JAN!G7=\"\",\"\",JAN!G7)","v":0},{"$f":"IF(JAN!H7=\"\",\"\",JAN!H7)","v":""},{"$f":"IF(JAN!I7=\"\",\"\",JAN!I7)","v":0},{"$f":"IF(JAN!J7=\"\",\"\",JAN!J7)","v":""},{"$f":"IF(JAN!K7=\"\",\"\",JAN!K7)","v":""},{"$f":"IF(JAN!L7=\"\",\"\",JAN!L7)","v":""},{"$f":"IF(JAN!M7=\"\",\"\",JAN!M7)","v":""},{"$f":"IF(JAN!N7=\"\",\"\",JAN!N7)","v":""},{"$f":"IF(JAN!O7=\"\",\"\",JAN!O7)","v":""},{"$f":"IF(JAN!P7=\"\",\"\",JAN!P7)","v":0},{"$f":"IF(JAN!Q7=\"\",\"\",JAN!Q7)","v":0},{"$f":"IF(JAN!R7=\"\",\"\",JAN!R7)","v":0},{"$f":"IF(JAN!S7=\"\",\"\",JAN!S7)","v":0},{"$f":"IF(JAN!T7=\"\",\"\",JAN!T7)","v":0},{"$f":"IF(JAN!U7=\"\",\"\",JAN!U7)","v":0},{"$f":"IF(JAN!V7=\"\",\"\",JAN!V7)","v":0}]
[null,3,{"$f":"IF(JAN!B8=\"\",\"\",JAN!B8)","v":0},{"$f":"IF(JAN!C8=\"\",\"\",JAN!C8)","v":0},{"$f":"IF(JAN!D8=\"\",\"\",JAN!D8)","v":0},{"$f":"IF(JAN!E8=\"\",\"\",JAN!E8)","v":""},{"$f":"IF(JAN!F8=\"\",\"\",JAN!F8)","v":0},{"$f":"IF(JAN!G8=\"\",\"\",JAN!G8)","v":0},{"$f":"IF(JAN!H8=\"\",\"\",JAN!H8)","v":""},{"$f":"IF(JAN!I8=\"\",\"\",JAN!I8)","v":0},{"$f":"IF(JAN!J8=\"\",\"\",JAN!J8)","v":""},{"$f":"IF(JAN!K8=\"\",\"\",JAN!K8)","v":""},{"$f":"IF(JAN!L8=\"\",\"\",JAN!L8)","v":""},{"$f":"IF(JAN!M8=\"\",\"\",JAN!M8)","v":""},{"$f":"IF(JAN!N8=\"\",\"\",JAN!N8)","v":""},{"$f":"IF(JAN!O8=\"\",\"\",JAN!O8)","v":""},{"$f":"IF(JAN!P8=\"\",\"\",JAN!P8)","v":0},{"$f":"IF(JAN!Q8=\"\",\"\",JAN!Q8)","v":0},{"$f":"IF(JAN!R8=\"\",\"\",JAN!R8)","v":0},{"$f":"IF(JAN!S8=\"\",\"\",JAN!S8)","v":0},{"$f":"IF(JAN!T8=\"\",\"\",JAN!T8)","v":0},{"$f":"IF(JAN!U8=\"\",\"\",JAN!U8)","v":0},{"$f":"IF(JAN!V8=\"\",\"\",JAN!V8)","v":0}]
[null,4,{"$f":"IF(JAN!B9=\"\",\"\",JAN!B9)","v":0},{"$f":"IF(JAN!C9=\"\",\"\",JAN!C9)","v":0},{"$f":"IF(JAN!D9=\"\",\"\",JAN!D9)","v":0},{"$f":"IF(JAN!E9=\"\",\"\",JAN!E9)","v":""},{"$f":"IF(JAN!F9=\"\",\"\",JAN!F9)","v":0},{"$f":"IF(JAN!G9=\"\",\"\",JAN!G9)","v":0},{"$f":"IF(JAN!H9=\"\",\"\",JAN!H9)","v":""},{"$f":"IF(JAN!I9=\"\",\"\",JAN!I9)","v":0},{"$f":"IF(JAN!J9=\"\",\"\",JAN!J9)","v":""},{"$f":"IF(JAN!K9=\"\",\"\",JAN!K9)","v":""},{"$f":"IF(JAN!L9=\"\",\"\",JAN!L9)","v":""},{"$f":"IF(JAN!M9=\"\",\"\",JAN!M9)","v":""},{"$f":"IF(JAN!N9=\"\",\"\",JAN!N9)","v":""},{"$f":"IF(JAN!O9=\"\",\"\",JAN!O9)","v":""},{"$f":"IF(JAN!P9=\"\",\"\",JAN!P9)","v":0},{"$f":"IF(JAN!Q9=\"\",\"\",JAN!Q9)","v":0},{"$f":"IF(JAN!R9=\"\",\"\",JAN!R9)","v":0},{"$f":"IF(JAN!S9=\"\",\"\",JAN!S9)","v":0},{"$f":"IF(JAN!T9=\"\",\"\",JAN!T9)","v":0},{"$f":"IF(JAN!U9=\"\",\"\",JAN!U9)","v":0},{"$f":"IF(JAN!V9=\"\",\"\",JAN!V9)","v":0}]
["FEB",5,{"$f":"IF(FEB!B6=\"\",\"\",FEB!B6)","v":0},{"$f":"IF(FEB!C6=\"\",\"\",FEB!C6)","v":0},{"$f":"IF(FEB!D6=\"\",\"\",FEB!D6)","v":0},{"$f":"IF(FEB!E6=\"\",\"\",FEB!E6)","v":""},{"$f":"IF(FEB!F6=\"\",\"\",FEB!F6)","v":0},{"$f":"IF(FEB!G6=\"\",\"\",FEB!G6)","v":0},{"$f":"IF(FEB!H6=\"\",\"\",FEB!H6)","v":""},{"$f":"IF(FEB!I6=\"\",\"\",FEB!I6)","v":0},{"$f":"IF(FEB!J6=\"\",\"\",FEB!J6)","v":""},{"$f":"IF(FEB!K6=\"\",\"\",FEB!K6)","v":""},{"$f":"IF(FEB!L6=\"\",\"\",FEB!L6)","v":""},{"$f":"IF(FEB!M6=\"\",\"\",FEB!M6)","v":""},{"$f":"IF(FEB!N6=\"\",\"\",FEB!N6)","v":""},{"$f":"IF(FEB!O6=\"\",\"\",FEB!O6)","v":""},{"$f":"IF(FEB!P6=\"\",\"\",FEB!P6)","v":0},{"$f":"IF(FEB!Q6=\"\",\"\",FEB!Q6)","v":0},{"$f":"IF(FEB!R6=\"\",\"\",FEB!R6)","v":0},{"$f":"IF(FEB!S6=\"\",\"\",FEB!S6)","v":0},{"$f":"IF(FEB!T6=\"\",\"\",FEB!T6)","v":0},{"$f":"IF(FEB!U6=\"\",\"\",FEB!U6)","v":""},{"$f":"IF(FEB!V6=\"\",\"\",FEB!V6)","v":0}]
[null,6,{"$f":"IF(FEB!B7=\"\",\"\",FEB!B7)","v":0},{"$f":"IF(FEB!C7=\"\",\"\",FEB!C7)","v":0},{"$f":"IF(FEB!D7=\"\",\"\",FEB!D7)","v":0},{"$f":"IF(FEB!E7=\"\",\"\",FEB!E7)","v":""},{"$f":"IF(FEB!F7=\"\",\"\",FEB!F7)","v":0},{"$f":"IF(FEB!G7=\"\",\"\",FEB!G7)","v":0},{"$f":"IF(FEB!H7=\"\",\"\",FEB!H7)","v":""},{"$f":"IF(FEB!I7=\"\",\"\",FEB!I7)","v":0},{"$f":"IF(FEB!J7=\"\",\"\",FEB!J7)","v":""},{"$f":"IF(FEB!K7=\"\",\"\",FEB!K7)","v":""},{"$f":"IF(FEB!L7=\"\",\"\",FEB!L7)","v":""},{"$f":"IF(FEB!M7=\"\",\"\",FEB!M7)","v":""},{"$f":"IF(FEB!N7=\"\",\"\",FEB!N7)","v":""},{"$f":"IF(FEB!O7=\"\",\"\",FEB!O7)","v":""},{"$f":"IF(FEB!P7=\"\",\"\",FEB!P7)","v":0},{"$f":"IF(FEB!Q7=\"\",\"\",FEB!Q7)","v":0},{"$f":"IF(FEB!R7=\"\",\"\",FEB!R7)","v":0},{"$f":"IF(FEB!S7=\"\",\"\",FEB!S7)","v":0},{"$f":"IF(FEB!T7=\"\",\"\",FEB!T7)","v":0},{"$f":"IF(FEB!U7=\"\",\"\",FEB!U7)","v":""},{"$f":"IF(FEB!V7=\"\",\"\",FEB!V7)","v":0}]
[null,7,{"$f":"IF(FEB!B8=\"\",\"\",FEB!B8)","v":0},{"$f":"IF(FEB!C8=\"\",\"\",FEB!C8)","v":0},{"$f":"IF(FEB!D8=\"\",\"\",FEB!D8)","v":0},{"$f":"IF(FEB!E8=\"\",\"\",FEB!E8)","v":""},{"$f":"IF(FEB!F8=\"\",\"\",FEB!F8)","v":0},{"$f":"IF(FEB!G8=\"\",\"\",FEB!G8)","v":0},{"$f":"IF(FEB!H8=\"\",\"\",FEB!H8)","v":""},{"$f":"IF(FEB!I8=\"\",\"\",FEB!I8)","v":0},{"$f":"IF(FEB!J8=\"\",\"\",FEB!J8)","v":""},{"$f":"IF(FEB!K8=\"\",\"\",FEB!K8)","v":""},{"$f":"IF(FEB!L8=\"\",\"\",FEB!L8)","v":""},{"$f":"IF(FEB!M8=\"\",\"\",FEB!M8)","v":""},{"$f":"IF(FEB!N8=\"\",\"\",FEB!N8)","v":""},{"$f":"IF(FEB!O8=\"\",\"\",FEB!O8)","v":""},{"$f":"IF(FEB!P8=\"\",\"\",FEB!P8)","v":0},{"$f":"IF(FEB!Q8=\"\",\"\",FEB!Q8)","v":0},{"$f":"IF(FEB!R8=\"\",\"\",FEB!R8)","v":0},{"$f":"IF(FEB!S8=\"\",\"\",FEB!S8)","v":0},{"$f":"IF(FEB!T8=\"\",\"\",FEB!T8)","v":0},{"$f":"IF(FEB!U8=\"\",\"\",FEB!U8)","v":""},{"$f":"IF(FEB!V8=\"\",\"\",FEB!V8)","v":0}]
[null,8,{"$f":"IF(FEB!B9=\"\",\"\",FEB!B9)","v":0},{"$f":"IF(FEB!C9=\"\",\"\",FEB!C9)","v":0},{"$f":"IF(FEB!D9=\"\",\"\",FEB!D9)","v":0},{"$f":"IF(FEB!E9=\"\",\"\",FEB!E9)","v":""},{"$f":"IF(FEB!F9=\"\",\"\",FEB!F9)","v":0},{"$f":"IF(FEB!G9=\"\",\"\",FEB!G9)","v":0},{"$f":"IF(FEB!H9=\"\",\"\",FEB!H9)","v":""},{"$f":"IF(FEB!I9=\"\",\"\",FEB!I9)","v":0},{"$f":"IF(FEB!J9=\"\",\"\",FEB!J9)","v":""},{"$f":"IF(FEB!K9=\"\",\"\",FEB!K9)","v":""},{"$f":"IF(FEB!L9=\"\",\"\",FEB!L9)","v":""},{"$f":"IF(FEB!M9=\"\",\"\",FEB!M9)","v":""},{"$f":"IF(FEB!N9=\"\",\"\",FEB!N9)","v":""},{"$f":"IF(FEB!O9=\"\",\"\",FEB!O9)","v":""},{"$f":"IF(FEB!P9=\"\",\"\",FEB!P9)","v":0},{"$f":"IF(FEB!Q9=\"\",\"\",FEB!Q9)","v":0},{"$f":"IF(FEB!R9=\"\",\"\",FEB!R9)","v":0},{"$f":"IF(FEB!S9=\"\",\"\",FEB!S9)","v":0},{"$f":"IF(FEB!T9=\"\",\"\",FEB!T9)","v":0},{"$f":"IF(FEB!U9=\"\",\"\",FEB!U9)","v":""},{"$f":"IF(FEB!V9=\"\",\"\",FEB!V9)","v":0}]
["MAR",9,{"$f":"IF(MAR!B6=\"\",\"\",MAR!B6)","v":0},{"$f":"IF(MAR!C6=\"\",\"\",MAR!C6)","v":0},{"$f":"IF(MAR!D6=\"\",\"\",MAR!D6)","v":0},{"$f":"IF(MAR!E6=\"\",\"\",MAR!E6)","v":""},{"$f":"IF(MAR!F6=\"\",\"\",MAR!F6)","v":0},{"$f":"IF(MAR!G6=\"\",\"\",MAR!G6)","v":0},{"$f":"IF(MAR!H6=\"\",\"\",MAR!H6)","v":""},{"$f":"IF(MAR!I6=\"\",\"\",MAR!I6)","v":0},{"$f":"IF(MAR!J6=\"\",\"\",MAR!J6)","v":""},{"$f":"IF(MAR!K6=\"\",\"\",MAR!K6)","v":""},{"$f":"IF(MAR!L6=\"\",\"\",MAR!L6)","v":""},{"$f":"IF(MAR!M6=\"\",\"\",MAR!M6)","v":""},{"$f":"IF(MAR!N6=\"\",\"\",MAR!N6)","v":""},{"$f":"IF(MAR!O6=\"\",\"\",MAR!O6)","v":""},{"$f":"IF(MAR!P6=\"\",\"\",MAR!P6)","v":0},{"$f":"IF(MAR!Q6=\"\",\"\",MAR!Q6)","v":0},{"$f":"IF(MAR!R6=\"\",\"\",MAR!R6)","v":0},{"$f":"IF(MAR!S6=\"\",\"\",MAR!S6)","v":0},{"$f":"IF(MAR!T6=\"\",\"\",MAR!T6)","v":0},{"$f":"IF(MAR!U6=\"\",\"\",MAR!U6)","v":""},{"$f":"IF(MAR!V6=\"\",\"\",MAR!V6)","v":0}]
[null,10,{"$f":"IF(MAR!B7=\"\",\"\",MAR!B7)","v":0},{"$f":"IF(MAR!C7=\"\",\"\",MAR!C7)","v":0},{"$f":"IF(MAR!D7=\"\",\"\",MAR!D7)","v":0},{"$f":"IF(MAR!E7=\"\",\"\",MAR!E7)","v":""},{"$f":"IF(MAR!F7=\"\",\"\",MAR!F7)","v":0},{"$f":"IF(MAR!G7=\"\",\"\",MAR!G7)","v":0},{"$f":"IF(MAR!H7=\"\",\"\",MAR!H7)","v":""},{"$f":"IF(MAR!I7=\"\",\"\",MAR!I7)","v":0},{"$f":"IF(MAR!J7=\"\",\"\",MAR!J7)","v":""},{"$f":"IF(MAR!K7=\"\",\"\",MAR!K7)","v":""},{"$f":"IF(MAR!L7=\"\",\"\",MAR!L7)","v":""},{"$f":"IF(MAR!M7=\"\",\"\",MAR!M7)","v":""},{"$f":"IF(MAR!N7=\"\",\"\",MAR!N7)","v":""},{"$f":"IF(MAR!O7=\"\",\"\",MAR!O7)","v":""},{"$f":"IF(MAR!P7=\"\",\"\",MAR!P7)","v":0},{"$f":"IF(MAR!Q7=\"\",\"\",MAR!Q7)","v":0},{"$f":"IF(MAR!R7=\"\",\"\",MAR!R7)","v":0},{"$f":"IF(MAR!S7=\"\",\"\",MAR!S7)","v":0},{"$f":"IF(MAR!T7=\"\",\"\",MAR!T7)","v":0},{"$f":"IF(MAR!U7=\"\",\"\",MAR!U7)","v":""},{"$f":"IF(MAR!V7=\"\",\"\",MAR!V7)","v":0}]
[null,11,{"$f":"IF(MAR!B8=\"\",\"\",MAR!B8)","v":0},{"$f":"IF(MAR!C8=\"\",\"\",MAR!C8)","v":0},{"$f":"IF(MAR!D8=\"\",\"\",MAR!D8)","v":0},{"$f":"IF(MAR!E8=\"\",\"\",MAR!E8)","v":""},{"$f":"IF(MAR!F8=\"\",\"\",MAR!F8)","v":0},{"$f":"IF(MAR!G8=\"\",\"\",MAR!G8)","v":0},{"$f":"IF(MAR!H8=\"\",\"\",MAR!H8)","v":""},{"$f":"IF(MAR!I8=\"\",\"\",MAR!I8)","v":0},{"$f":"IF(MAR!J8=\"\",\"\",MAR!J8)","v":""},{"$f":"IF(MAR!K8=\"\",\"\",MAR!K8)","v":""},{"$f":"IF(MAR!L8=\"\",\"\",MAR!L8)","v":""},{"$f":"IF(MAR!M8=\"\",\"\",MAR!M8)","v":""},{"$f":"IF(MAR!N8=\"\",\"\",MAR!N8)","v":""},{"$f":"IF(MAR!O8=\"\",\"\",MAR!O8)","v":""},{"$f":"IF(MAR!P8=\"\",\"\",MAR!P8)","v":0},{"$f":"IF(MAR!Q8=\"\",\"\",MAR!Q8)","v":0},{"$f":"IF(MAR!R8=\"\",\"\",MAR!R8)","v":0},{"$f":"IF(MAR!S8=\"\",\"\",MAR!S8)","v":0},{"$f":"IF(MAR!T8=\"\",\"\",MAR!T8)","v":0},{"$f":"IF(MAR!U8=\"\",\"\",MAR!U8)","v":""},{"$f":"IF(MAR!V8=\"\",\"\",MAR!V8)","v":0}]
[null,12,{"$f":"IF(MAR!B9=\"\",\"\",MAR!B9)","v":0},{"$f":"IF(MAR!C9=\"\",\"\",MAR!C9)","v":0},{"$f":"IF(MAR!D9=\"\",\"\",MAR!D9)","v":0},{"$f":"IF(MAR!E9=\"\",\"\",MAR!E9)","v":""},{"$f":"IF(MAR!F9=\"\",\"\",MAR!F9)","v":0},{"$f":"IF(MAR!G9=\"\",\"\",MAR!G9)","v":0},{"$f":"IF(MAR!H9=\"\",\"\",MAR!H9)","v":""},{"$f":"IF(MAR!I9=\"\",\"\",MAR!I9)","v":0},{"$f":"IF(MAR!J9=\"\",\"\",MAR!J9)","v":""},{"$f":"IF(MAR!K9=\"\",\"\",MAR!K9)","v":""},{"$f":"IF(MAR!L9=\"\",\"\",MAR!L9)","v":""},{"$f":"IF(MAR!M9=\"\",\"\",MAR!M9)","v":""},{"$f":"IF(MAR!N9=\"\",\"\",MAR!N9)","v":""},{"$f":"IF(MAR!O9=\"\",\"\",MAR!O9)","v":""},{"$f":"IF(MAR!P9=\"\",\"\",MAR!P9)","v":0},{"$f":"IF(MAR!Q9=\"\",\"\",MAR!Q9)","v":0},{"$f":"IF(MAR!R9=\"\",\"\",MAR!R9)","v":0},{"$f":"IF(MAR!S9=\"\",\"\",MAR!S9)","v":0},{"$f":"IF(MAR!T9=\"\",\"\",MAR!T9)","v":0},{"$f":"IF(MAR!U9=\"\",\"\",MAR!U9)","v":""},{"$f":"IF(MAR!V9=\"\",\"\",MAR!V9)","v":0}]
["APR",13,{"$f":"IF(APR!B6=\"\",\"\",APR!B6)","v":0},{"$f":"IF(APR!C6=\"\",\"\",APR!C6)","v":0},{"$f":"IF(APR!D6=\"\",\"\",APR!D6)","v":0},{"$f":"IF(APR!E6=\"\",\"\",APR!E6)","v":""},{"$f":"IF(APR!F6=\"\",\"\",APR!F6)","v":0},{"$f":"IF(APR!G6=\"\",\"\",APR!G6)","v":0},{"$f":"IF(APR!H6=\"\",\"\",APR!H6)","v":""},{"$f":"IF(APR!I6=\"\",\"\",APR!I6)","v":0},{"$f":"IF(APR!J6=\"\",\"\",APR!J6)","v":""},{"$f":"IF(APR!K6=\"\",\"\",APR!K6)","v":""},{"$f":"IF(APR!L6=\"\",\"\",APR!L6)","v":""},{"$f":"IF(APR!M6=\"\",\"\",APR!M6)","v":""},{"$f":"IF(APR!N6=\"\",\"\",APR!N6)","v":""},{"$f":"IF(APR!O6=\"\",\"\",APR!O6)","v":""},{"$f":"IF(APR!P6=\"\",\"\",APR!P6)","v":0},{"$f":"IF(APR!Q6=\"\",\"\",APR!Q6)","v":0},{"$f":"IF(APR!R6=\"\",\"\",APR!R6)","v":0},{"$f":"IF(APR!S6=\"\",\"\",APR!S6)","v":0},{"$f":"IF(APR!T6=\"\",\"\",APR!T6)","v":0},{"$f":"IF(APR!U6=\"\",\"\",APR!U6)","v":""},{"$f":"IF(APR!V6=\"\",\"\",APR!V6)","v":0}]
[null,14,{"$f":"IF(APR!B7=\"\",\"\",APR!B7)","v":0},{"$f":"IF(APR!C7=\"\",\"\",APR!C7)","v":0},{"$f":"IF(APR!D7=\"\",\"\",APR!D7)","v":0},{"$f":"IF(APR!E7=\"\",\"\",APR!E7)","v":""},{"$f":"IF(APR!F7=\"\",\"\",APR!F7)","v":0},{"$f":"IF(APR!G7=\"\",\"\",APR!G7)","v":0},{"$f":"IF(APR!H7=\"\",\"\",APR!H7)","v":""},{"$f":"IF(APR!I7=\"\",\"\",APR!I7)","v":0},{"$f":"IF(APR!J7=\"\",\"\",APR!J7)","v":""},{"$f":"IF(APR!K7=\"\",\"\",APR!K7)","v":""},{"$f":"IF(APR!L7=\"\",\"\",APR!L7)","v":""},{"$f":"IF(APR!M7=\"\",\"\",APR!M7)","v":""},{"$f":"IF(APR!N7=\"\",\"\",APR!N7)","v":""},{"$f":"IF(APR!O7=\"\",\"\",APR!O7)","v":""},{"$f":"IF(APR!P7=\"\",\"\",APR!P7)","v":0},{"$f":"IF(APR!Q7=\"\",\"\",APR!Q7)","v":0},{"$f":"IF(APR!R7=\"\",\"\",APR!R7)","v":0},{"$f":"IF(APR!S7=\"\",\"\",APR!S7)","v":0},{"$f":"IF(APR!T7=\"\",\"\",APR!T7)","v":0},{"$f":"IF(APR!U7=\"\",\"\",APR!U7)","v":""},{"$f":"IF(APR!V7=\"\",\"\",APR!V7)","v":0}]
[null,15,{"$f":"IF(APR!B8=\"\",\"\",APR!B8)","v":0},{"$f":"IF(APR!C8=\"\",\"\",APR!C8)","v":0},{"$f":"IF(APR!D8=\"\",\"\",APR!D8)","v":0},{"$f":"IF(APR!E8=\"\",\"\",APR!E8)","v":""},{"$f":"IF(APR!F8=\"\",\"\",APR!F8)","v":0},{"$f":"IF(APR!G8=\"\",\"\",APR!G8)","v":0},{"$f":"IF(APR!H8=\"\",\"\",APR!H8)","v":""},{"$f":"IF(APR!I8=\"\",\"\",APR!I8)","v":0},{"$f":"IF(APR!J8=\"\",\"\",APR!J8)","v":""},{"$f":"IF(APR!K8=\"\",\"\",APR!K8)","v":""},{"$f":"IF(APR!L8=\"\",\"\",APR!L8)","v":""},{"$f":"IF(APR!M8=\"\",\"\",APR!M8)","v":""},{"$f":"IF(APR!N8=\"\",\"\",APR!N8)","v":""},{"$f":"IF(APR!O8=\"\",\"\",APR!O8)","v":""},{"$f":"IF(APR!P8=\"\",\"\",APR!P8)","v":0},{"$f":"IF(APR!Q8=\"\",\"\",APR!Q8)","v":0},{"$f":"IF(APR!R8=\"\",\"\",APR!R8)","v":0},{"$f":"IF(APR!S8=\"\",\"\",APR!S8)","v":0},{"$f":"IF(APR!T8=\"\",\"\",APR!T8)","v":0},{"$f":"IF(APR!U8=\"\",\"\",APR!U8)","v":""},{"$f":"IF(APR!V8=\"\",\"\",APR!V8)","v":0}]
[null,16,{"$f":"IF(APR!B9=\"\",\"\",APR!B9)","v":0},{"$f":"IF(APR!C9=\"\",\"\",APR!C9)","v":0},{"$f":"IF(APR!D9=\"\",\"\",APR!D9)","v":0},{"$f":"IF(APR!E9=\"\",\"\",APR!E9)","v":""},{"$f":"IF(APR!F9=\"\",\"\",APR!F9)","v":0},{"$f":"IF(APR!G9=\"\",\"\",APR!G9)","v":0},{"$f":"IF(APR!H9=\"\",\"\",APR!H9)","v":""},{"$f":"IF(APR!I9=\"\",\"\",APR!I9)","v":0},{"$f":"IF(APR!J9=\"\",\"\",APR!J9)","v":""},{"$f":"IF(APR!K9=\"\",\"\",APR!K9)","v":""},{"$f":"IF(APR!L9=\"\",\"\",APR!L9)","v":""},{"$f":"IF(APR!M9=\"\",\"\",APR!M9)","v":""},{"$f":"IF(APR!N9=\"\",\"\",APR!N9)","v":""},{"$f":"IF(APR!O9=\"\",\"\",APR!O9)","v":""},{"$f":"IF(APR!P9=\"\",\"\",APR!P9)","v":0},{"$f":"IF(APR!Q9=\"\",\"\",APR!Q9)","v":0},{"$f":"IF(APR!R9=\"\",\"\",APR!R9)","v":0},{"$f":"IF(APR!S9=\"\",\"\",APR!S9)","v":0},{"$f":"IF(APR!T9=\"\",\"\",APR!T9)","v":0},{"$f":"IF(APR!U9=\"\",\"\",APR!U9)","v":""},{"$f":"IF(APR!V9=\"\",\"\",APR!V9)","v":0}]
[null,17,{"$f":"IF(APR!B10=\"\",\"\",APR!B10)","v":0},{"$f":"IF(APR!C10=\"\",\"\",APR!C10)","v":0},{"$f":"IF(APR!D10=\"\",\"\",APR!D10)","v":0},{"$f":"IF(APR!E10=\"\",\"\",APR!E10)","v":""},{"$f":"IF(APR!F10=\"\",\"\",APR!F10)","v":0},{"$f":"IF(APR!G10=\"\",\"\",APR!G10)","v":0},{"$f":"IF(APR!H10=\"\",\"\",APR!H10)","v":""},{"$f":"IF(APR!I10=\"\",\"\",APR!I10)","v":0},{"$f":"IF(APR!J10=\"\",\"\",APR!J10)","v":""},{"$f":"IF(APR!K10=\"\",\"\",APR!K10)","v":""},{"$f":"IF(APR!L10=\"\",\"\",APR!L10)","v":""},{"$f":"IF(APR!M10=\"\",\"\",APR!M10)","v":""},{"$f":"IF(APR!N10=\"\",\"\",APR!N10)","v":""},{"$f":"IF(APR!O10=\"\",\"\",APR!O10)","v":""},{"$f":"IF(APR!P10=\"\",\"\",APR!P10)","v":0},{"$f":"IF(APR!Q10=\"\",\"\",APR!Q10)","v":0},{"$f":"IF(APR!R10=\"\",\"\",APR!R10)","v":0},{"$f":"IF(APR!S10=\"\",\"\",APR!S10)","v":0},{"$f":"IF(APR!T10=\"\",\"\",APR!T10)","v":0},{"$f":"IF(APR!U10=\"\",\"\",APR!U10)","v":""},{"$f":"IF(APR!V10=\"\",\"\",APR!V10)","v":0}]
["MAY",18,{"$f":"IF(MAY!B6=\"\",\"\",MAY!B6)","v":0},{"$f":"IF(MAY!C6=\"\",\"\",MAY!C6)","v":0},{"$f":"IF(MAY!D6=\"\",\"\",MAY!D6)","v":0},{"$f":"IF(MAY!E6=\"\",\"\",MAY!E6)","v":""},{"$f":"IF(MAY!F6=\"\",\"\",MAY!F6)","v":0},{"$f":"IF(MAY!G6=\"\",\"\",MAY!G6)","v":0},{"$f":"IF(MAY!H6=\"\",\"\",MAY!H6)","v":""},{"$f":"IF(MAY!I6=\"\",\"\",MAY!I6)","v":0},{"$f":"IF(MAY!J6=\"\",\"\",MAY!J6)","v":""},{"$f":"IF(MAY!K6=\"\",\"\",MAY!K6)","v":""},{"$f":"IF(MAY!L6=\"\",\"\",MAY!L6)","v":""},{"$f":"IF(MAY!M6=\"\",\"\",MAY!M6)","v":""},{"$f":"IF(MAY!N6=\"\",\"\",MAY!N6)","v":""},{"$f":"IF(MAY!O6=\"\",\"\",MAY!O6)","v":""},{"$f":"IF(MAY!P6=\"\",\"\",MAY!P6)","v":0},{"$f":"IF(MAY!Q6=\"\",\"\",MAY!Q6)","v":0},{"$f":"IF(MAY!R6=\"\",\"\",MAY!R6)","v":0},{"$f":"IF(MAY!S6=\"\",\"\",MAY!S6)","v":0},{"$f":"IF(MAY!T6=\"\",\"\",MAY!T6)","v":0},{"$f":"IF(MAY!U6=\"\",\"\",MAY!U6)","v":""},{"$f":"IF(MAY!V6=\"\",\"\",MAY!V6)","v":0}]
[null,19,{"$f":"IF(MAY!B7=\"\",\"\",MAY!B7)","v":0},{"$f":"IF(MAY!C7=\"\",\"\",MAY!C7)","v":0},{"$f":"IF(MAY!D7=\"\",\"\",MAY!D7)","v":0},{"$f":"IF(MAY!E7=\"\",\"\",MAY!E7)","v":""},{"$f":"IF(MAY!F7=\"\",\"\",MAY!F7)","v":0},{"$f":"IF(MAY!G7=\"\",\"\",MAY!G7)","v":0},{"$f":"IF(MAY!H7=\"\",\"\",MAY!H7)","v":""},{"$f":"IF(MAY!I7=\"\",\"\",MAY!I7)","v":0},{"$f":"IF(MAY!J7=\"\",\"\",MAY!J7)","v":""},{"$f":"IF(MAY!K7=\"\",\"\",MAY!K7)","v":""},{"$f":"IF(MAY!L7=\"\",\"\",MAY!L7)","v":""},{"$f":"IF(MAY!M7=\"\",\"\",MAY!M7)","v":""},{"$f":"IF(MAY!N7=\"\",\"\",MAY!N7)","v":""},{"$f":"IF(MAY!O7=\"\",\"\",MAY!O7)","v":""},{"$f":"IF(MAY!P7=\"\",\"\",MAY!P7)","v":0},{"$f":"IF(MAY!Q7=\"\",\"\",MAY!Q7)","v":0},{"$f":"IF(MAY!R7=\"\",\"\",MAY!R7)","v":0},{"$f":"IF(MAY!S7=\"\",\"\",MAY!S7)","v":0},{"$f":"IF(MAY!T7=\"\",\"\",MAY!T7)","v":0},{"$f":"IF(MAY!U7=\"\",\"\",MAY!U7)","v":""},{"$f":"IF(MAY!V7=\"\",\"\",MAY!V7)","v":0}]
[null,20,{"$f":"IF(MAY!B8=\"\",\"\",MAY!B8)","v":0},{"$f":"IF(MAY!C8=\"\",\"\",MAY!C8)","v":0},{"$f":"IF(MAY!D8=\"\",\"\",MAY!D8)","v":0},{"$f":"IF(MAY!E8=\"\",\"\",MAY!E8)","v":""},{"$f":"IF(MAY!F8=\"\",\"\",MAY!F8)","v":0},{"$f":"IF(MAY!G8=\"\",\"\",MAY!G8)","v":0},{"$f":"IF(MAY!H8=\"\",\"\",MAY!H8)","v":""},{"$f":"IF(MAY!I8=\"\",\"\",MAY!I8)","v":0},{"$f":"IF(MAY!J8=\"\",\"\",MAY!J8)","v":""},{"$f":"IF(MAY!K8=\"\",\"\",MAY!K8)","v":""},{"$f":"IF(MAY!L8=\"\",\"\",MAY!L8)","v":""},{"$f":"IF(MAY!M8=\"\",\"\",MAY!M8)","v":""},{"$f":"IF(MAY!N8=\"\",\"\",MAY!N8)","v":""},{"$f":"IF(MAY!O8=\"\",\"\",MAY!O8)","v":""},{"$f":"IF(MAY!P8=\"\",\"\",MAY!P8)","v":0},{"$f":"IF(MAY!Q8=\"\",\"\",MAY!Q8)","v":0},{"$f":"IF(MAY!R8=\"\",\"\",MAY!R8)","v":0},{"$f":"IF(MAY!S8=\"\",\"\",MAY!S8)","v":0},{"$f":"IF(MAY!T8=\"\",\"\",MAY!T8)","v":0},{"$f":"IF(MAY!U8=\"\",\"\",MAY!U8)","v":""},{"$f":"IF(MAY!V8=\"\",\"\",MAY!V8)","v":0}]
[null,21,{"$f":"IF(MAY!B9=\"\",\"\",MAY!B9)","v":0},{"$f":"IF(MAY!C9=\"\",\"\",MAY!C9)","v":0},{"$f":"IF(MAY!D9=\"\",\"\",MAY!D9)","v":0},{"$f":"IF(MAY!E9=\"\",\"\",MAY!E9)","v":""},{"$f":"IF(MAY!F9=\"\",\"\",MAY!F9)","v":0},{"$f":"IF(MAY!G9=\"\",\"\",MAY!G9)","v":0},{"$f":"IF(MAY!H9=\"\",\"\",MAY!H9)","v":""},{"$f":"IF(MAY!I9=\"\",\"\",MAY!I9)","v":0},{"$f":"IF(MAY!J9=\"\",\"\",MAY!J9)","v":""},{"$f":"IF(MAY!K9=\"\",\"\",MAY!K9)","v":""},{"$f":"IF(MAY!L9=\"\",\"\",MAY!L9)","v":""},{"$f":"IF(MAY!M9=\"\",\"\",MAY!M9)","v":""},{"$f":"IF(MAY!N9=\"\",\"\",MAY!N9)","v":""},{"$f":"IF(MAY!O9=\"\",\"\",MAY!O9)","v":""},{"$f":"IF(MAY!P9=\"\",\"\",MAY!P9)","v":0},{"$f":"IF(MAY!Q9=\"\",\"\",MAY!Q9)","v":0},{"$f":"IF(MAY!R9=\"\",\"\",MAY!R9)","v":0},{"$f":"IF(MAY!S9=\"\",\"\",MAY!S9)","v":0},{"$f":"IF(MAY!T9=\"\",\"\",MAY!T9)","v":0},{"$f":"IF(MAY!U9=\"\",\"\",MAY!U9)","v":""},{"$f":"IF(MAY!V9=\"\",\"\",MAY!V9)","v":0}]
["JUNE",22,{"$f":"IF(JUNE!B6=\"\",\"\",JUNE!B6)","v":0},{"$f":"IF(JUNE!C6=\"\",\"\",JUNE!C6)","v":0},{"$f":"IF(JUNE!D6=\"\",\"\",JUNE!D6)","v":0},{"$f":"IF(JUNE!E6=\"\",\"\",JUNE!E6)","v":""},{"$f":"IF(JUNE!F6=\"\",\"\",JUNE!F6)","v":0},{"$f":"IF(JUNE!G6=\"\",\"\",JUNE!G6)","v":0},{"$f":"IF(JUNE!H6=\"\",\"\",JUNE!H6)","v":""},{"$f":"IF(JUNE!I6=\"\",\"\",JUNE!I6)","v":0},{"$f":"IF(JUNE!J6=\"\",\"\",JUNE!J6)","v":""},{"$f":"IF(JUNE!K6=\"\",\"\",JUNE!K6)","v":""},{"$f":"IF(JUNE!L6=\"\",\"\",JUNE!L6)","v":""},{"$f":"IF(JUNE!M6=\"\",\"\",JUNE!M6)","v":""},{"$f":"IF(JUNE!N6=\"\",\"\",JUNE!N6)","v":""},{"$f":"IF(JUNE!O6=\"\",\"\",JUNE!O6)","v":""},{"$f":"IF(JUNE!P6=\"\",\"\",JUNE!P6)","v":0},{"$f":"IF(JUNE!Q6=\"\",\"\",JUNE!Q6)","v":0},{"$f":"IF(JUNE!R6=\"\",\"\",JUNE!R6)","v":0},{"$f":"IF(JUNE!S6=\"\",\"\",JUNE!S6)","v":0},{"$f":"IF(JUNE!T6=\"\",\"\",JUNE!T6)","v":0},{"$f":"IF(JUNE!U6=\"\",\"\",JUNE!U6)","v":""},{"$f":"IF(JUNE!V6=\"\",\"\",JUNE!V6)","v":0}]
[null,23,{"$f":"IF(JUNE!B7=\"\",\"\",JUNE!B7)","v":0},{"$f":"IF(JUNE!C7=\"\",\"\",JUNE!C7)","v":0},{"$f":"IF(JUNE!D7=\"\",\"\",JUNE!D7)","v":0},{"$f":"IF(JUNE!E7=\"\",\"\",JUNE!E7)","v":""},{"$f":"IF(JUNE!F7=\"\",\"\",JUNE!F7)","v":0},{"$f":"IF(JUNE!G7=\"\",\"\",JUNE!G7)","v":0},{"$f":"IF(JUNE!H7=\"\",\"\",JUNE!H7)","v":""},{"$f":"IF(JUNE!I7=\"\",\"\",JUNE!I7)","v":0},{"$f":"IF(JUNE!J7=\"\",\"\",JUNE!J7)","v":""},{"$f":"IF(JUNE!K7=\"\",\"\",JUNE!K7)","v":""},{"$f":"IF(JUNE!L7=\"\",\"\",JUNE!L7)","v":""},{"$f":"IF(JUNE!M7=\"\",\"\",JUNE!M7)","v":""},{"$f":"IF(JUNE!N7=\"\",\"\",JUNE!N7)","v":""},{"$f":"IF(JUNE!O7=\"\",\"\",JUNE!O7)","v":""},{"$f":"IF(JUNE!P7=\"\",\"\",JUNE!P7)","v":0},{"$f":"IF(JUNE!Q7=\"\",\"\",JUNE!Q7)","v":0},{"$f":"IF(JUNE!R7=\"\",\"\",JUNE!R7)","v":0},{"$f":"IF(JUNE!S7=\"\",\"\",JUNE!S7)","v":0},{"$f":"IF(JUNE!T7=\"\",\"\",JUNE!T7)","v":0},{"$f":"IF(JUNE!U7=\"\",\"\",JUNE!U7)","v":""},{"$f":"IF(JUNE!V7=\"\",\"\",JUNE!V7)","v":0}]
[null,24,{"$f":"IF(JUNE!B8=\"\",\"\",JUNE!B8)","v":0},{"$f":"IF(JUNE!C8=\"\",\"\",JUNE!C8)","v":0},{"$f":"IF(JUNE!D8=\"\",\"\",JUNE!D8)","v":0},{"$f":"IF(JUNE!E8=\"\",\"\",JUNE!E8)","v":""},{"$f":"IF(JUNE!F8=\"\",\"\",JUNE!F8)","v":0},{"$f":"IF(JUNE!G8=\"\",\"\",JUNE!G8)","v":0},{"$f":"IF(JUNE!H8=\"\",\"\",JUNE!H8)","v":""},{"$f":"IF(JUNE!I8=\"\",\"\",JUNE!I8)","v":0},{"$f":"IF(JUNE!J8=\"\",\"\",JUNE!J8)","v":""},{"$f":"IF(JUNE!K8=\"\",\"\",JUNE!K8)","v":""},{"$f":"IF(JUNE!L8=\"\",\"\",JUNE!L8)","v":""},{"$f":"IF(JUNE!M8=\"\",\"\",JUNE!M8)","v":""},{"$f":"IF(JUNE!N8=\"\",\"\",JUNE!N8)","v":""},{"$f":"IF(JUNE!O8=\"\",\"\",JUNE!O8)","v":""},{"$f":"IF(JUNE!P8=\"\",\"\",JUNE!P8)","v":0},{"$f":"IF(JUNE!Q8=\"\",\"\",JUNE!Q8)","v":0},{"$f":"IF(JUNE!R8=\"\",\"\",JUNE!R8)","v":0},{"$f":"IF(JUNE!S8=\"\",\"\",JUNE!S8)","v":0},{"$f":"IF(JUNE!T8=\"\",\"\",JUNE!T8)","v":0},{"$f":"IF(JUNE!U8=\"\",\"\",JUNE!U8)","v":""},{"$f":"IF(JUNE!V8=\"\",\"\",JUNE!V8)","v":0}]
[null,25,{"$f":"IF(JUNE!B9=\"\",\"\",JUNE!B9)","v":0},{"$f":"IF(JUNE!C9=\"\",\"\",JUNE!C9)","v":0},{"$f":"IF(JUNE!D9=\"\",\"\",JUNE!D9)","v":0},{"$f":"IF(JUNE!E9=\"\",\"\",JUNE!E9)","v":""},{"$f":"IF(JUNE!F9=\"\",\"\",JUNE!F9)","v":0},{"$f":"IF(JUNE!G9=\"\",\"\",JUNE!G9)","v":0},{"$f":"IF(JUNE!H9=\"\",\"\",JUNE!H9)","v":""},{"$f":"IF(JUNE!I9=\"\",\"\",JUNE!I9)","v":0},{"$f":"IF(JUNE!J9=\"\",\"\",JUNE!J9)","v":""},{"$f":"IF(JUNE!K9=\"\",\"\",JUNE!K9)","v":""},{"$f":"IF(JUNE!L9=\"\",\"\",JUNE!L9)","v":""},{"$f":"IF(JUNE!M9=\"\",\"\",JUNE!M9)","v":""},{"$f":"IF(JUNE!N9=\"\",\"\",JUNE!N9)","v":""},{"$f":"IF(JUNE!O9=\"\",\"\",JUNE!O9)","v":""},{"$f":"IF(JUNE!P9=\"\",\"\",JUNE!P9)","v":0},{"$f":"IF(JUNE!Q9=\"\",\"\",JUNE!Q9)","v":0},{"$f":"IF(JUNE!R9=\"\",\"\",JUNE!R9)","v":0},{"$f":"IF(JUNE!S9=\"\",\"\",JUNE!S9)","v":0},{"$f":"IF(JUNE!T9=\"\",\"\",JUNE!T9)","v":0},{"$f":"IF(JUNE!U9=\"\",\"\",JUNE!U9)","v":""},{"$f":"IF(JUNE!V9=\"\",\"\",JUNE!V9)","v":0}]
["JULY",26,{"$f":"IF(JULY!B6=\"\",\"\",JULY!B6)","v":0},{"$f":"IF(JULY!C6=\"\",\"\",JULY!C6)","v":0},{"$f":"IF(JULY!D6=\"\",\"\",JULY!D6)","v":0},{"$f":"IF(JULY!E6=\"\",\"\",JULY!E6)","v":""},{"$f":"IF(JULY!F6=\"\",\"\",JULY!F6)","v":0},{"$f":"IF(JULY!G6=\"\",\"\",JULY!G6)","v":0},{"$f":"IF(JULY!H6=\"\",\"\",JULY!H6)","v":""},{"$f":"IF(JULY!I6=\"\",\"\",JULY!I6)","v":0},{"$f":"IF(JULY!J6=\"\",\"\",JULY!J6)","v":""},{"$f":"IF(JULY!K6=\"\",\"\",JULY!K6)","v":""},{"$f":"IF(JULY!L6=\"\",\"\",JULY!L6)","v":""},{"$f":"IF(JULY!M6=\"\",\"\",JULY!M6)","v":""},{"$f":"IF(JULY!N6=\"\",\"\",JULY!N6)","v":""},{"$f":"IF(JULY!O6=\"\",\"\",JULY!O6)","v":""},{"$f":"IF(JULY!P6=\"\",\"\",JULY!P6)","v":0},{"$f":"IF(JULY!Q6=\"\",\"\",JULY!Q6)","v":0},{"$f":"IF(JULY!R6=\"\",\"\",JULY!R6)","v":0},{"$f":"IF(JULY!S6=\"\",\"\",JULY!S6)","v":0},{"$f":"IF(JULY!T6=\"\",\"\",JULY!T6)","v":0},{"$f":"IF(JULY!U6=\"\",\"\",JULY!U6)","v":""},{"$f":"IF(JULY!V6=\"\",\"\",JULY!V6)","v":0}]
[null,27,{"$f":"IF(JULY!B7=\"\",\"\",JULY!B7)","v":0},{"$f":"IF(JULY!C7=\"\",\"\",JULY!C7)","v":0},{"$f":"IF(JULY!D7=\"\",\"\",JULY!D7)","v":0},{"$f":"IF(JULY!E7=\"\",\"\",JULY!E7)","v":""},{"$f":"IF(JULY!F7=\"\",\"\",JULY!F7)","v":0},{"$f":"IF(JULY!G7=\"\",\"\",JULY!G7)","v":0},{"$f":"IF(JULY!H7=\"\",\"\",JULY!H7)","v":""},{"$f":"IF(JULY!I7=\"\",\"\",JULY!I7)","v":0},{"$f":"IF(JULY!J7=\"\",\"\",JULY!J7)","v":""},{"$f":"IF(JULY!K7=\"\",\"\",JULY!K7)","v":""},{"$f":"IF(JULY!L7=\"\",\"\",JULY!L7)","v":""},{"$f":"IF(JULY!M7=\"\",\"\",JULY!M7)","v":""},{"$f":"IF(JULY!N7=\"\",\"\",JULY!N7)","v":""},{"$f":"IF(JULY!O7=\"\",\"\",JULY!O7)","v":""},{"$f":"IF(JULY!P7=\"\",\"\",JULY!P7)","v":0},{"$f":"IF(JULY!Q7=\"\",\"\",JULY!Q7)","v":0},{"$f":"IF(JULY!R7=\"\",\"\",JULY!R7)","v":0},{"$f":"IF(JULY!S7=\"\",\"\",JULY!S7)","v":0},{"$f":"IF(JULY!T7=\"\",\"\",JULY!T7)","v":0},{"$f":"IF(JULY!U7=\"\",\"\",JULY!U7)","v":""},{"$f":"IF(JULY!V7=\"\",\"\",JULY!V7)","v":0}]
[null,28,{"$f":"IF(JULY!B8=\"\",\"\",JULY!B8)","v":0},{"$f":"IF(JULY!C8=\"\",\"\",JULY!C8)","v":0},{"$f":"IF(JULY!D8=\"\",\"\",JULY!D8)","v":0},{"$f":"IF(JULY!E8=\"\",\"\",JULY!E8)","v":""},{"$f":"IF(JULY!F8=\"\",\"\",JULY!F8)","v":0},{"$f":"IF(JULY!G8=\"\",\"\",JULY!G8)","v":0},{"$f":"IF(JULY!H8=\"\",\"\",JULY!H8)","v":""},{"$f":"IF(JULY!I8=\"\",\"\",JULY!I8)","v":0},{"$f":"IF(JULY!J8=\"\",\"\",JULY!J8)","v":""},{"$f":"IF(JULY!K8=\"\",\"\",JULY!K8)","v":""},{"$f":"IF(JULY!L8=\"\",\"\",JULY!L8)","v":""},{"$f":"IF(JULY!M8=\"\",\"\",JULY!M8)","v":""},{"$f":"IF(JULY!N8=\"\",\"\",JULY!N8)","v":""},{"$f":"IF(JULY!O8=\"\",\"\",JULY!O8)","v":""},{"$f":"IF(JULY!P8=\"\",\"\",JULY!P8)","v":0},{"$f":"IF(JULY!Q8=\"\",\"\",JULY!Q8)","v":0},{"$f":"IF(JULY!R8=\"\",\"\",JULY!R8)","v":0},{"$f":"IF(JULY!S8=\"\",\"\",JULY!S8)","v":0},{"$f":"IF(JULY!T8=\"\",\"\",JULY!T8)","v":0},{"$f":"IF(JULY!U8=\"\",\"\",JULY!U8)","v":""},{"$f":"IF(JULY!V8=\"\",\"\",JULY!V8)","v":0}]
[null,29,{"$f":"IF(JULY!B9=\"\",\"\",JULY!B9)","v":0},{"$f":"IF(JULY!C9=\"\",\"\",JULY!C9)","v":0},{"$f":"IF(JULY!D9=\"\",\"\",JULY!D9)","v":0},{"$f":"IF(JULY!E9=\"\",\"\",JULY!E9)","v":""},{"$f":"IF(JULY!F9=\"\",\"\",JULY!F9)","v":0},{"$f":"IF(JULY!G9=\"\",\"\",JULY!G9)","v":0},{"$f":"IF(JULY!H9=\"\",\"\",JULY!H9)","v":""},{"$f":"IF(JULY!I9=\"\",\"\",JULY!I9)","v":0},{"$f":"IF(JULY!J9=\"\",\"\",JULY!J9)","v":""},{"$f":"IF(JULY!K9=\"\",\"\",JULY!K9)","v":""},{"$f":"IF(JULY!L9=\"\",\"\",JULY!L9)","v":""},{"$f":"IF(JULY!M9=\"\",\"\",JULY!M9)","v":""},{"$f":"IF(JULY!N9=\"\",\"\",JULY!N9)","v":""},{"$f":"IF(JULY!O9=\"\",\"\",JULY!O9)","v":""},{"$f":"IF(JULY!P9=\"\",\"\",JULY!P9)","v":0},{"$f":"IF(JULY!Q9=\"\",\"\",JULY!Q9)","v":0},{"$f":"IF(JULY!R9=\"\",\"\",JULY!R9)","v":0},{"$f":"IF(JULY!S9=\"\",\"\",JULY!S9)","v":0},{"$f":"IF(JULY!T9=\"\",\"\",JULY!T9)","v":0},{"$f":"IF(JULY!U9=\"\",\"\",JULY!U9)","v":""},{"$f":"IF(JULY!V9=\"\",\"\",JULY!V9)","v":0}]
[null,30,{"$f":"IF(JULY!B10=\"\",\"\",JULY!B10)","v":0},{"$f":"IF(JULY!C10=\"\",\"\",JULY!C10)","v":0},{"$f":"IF(JULY!D10=\"\",\"\",JULY!D10)","v":0},{"$f":"IF(JULY!E10=\"\",\"\",JULY!E10)","v":""},{"$f":"IF(JULY!F10=\"\",\"\",JULY!F10)","v":0},{"$f":"IF(JULY!G10=\"\",\"\",JULY!G10)","v":0},{"$f":"IF(JULY!H10=\"\",\"\",JULY!H10)","v":""},{"$f":"IF(JULY!I10=\"\",\"\",JULY!I10)","v":0},{"$f":"IF(JULY!J10=\"\",\"\",JULY!J10)","v":""},{"$f":"IF(JULY!K10=\"\",\"\",JULY!K10)","v":""},{"$f":"IF(JULY!L10=\"\",\"\",JULY!L10)","v":""},{"$f":"IF(JULY!M10=\"\",\"\",JULY!M10)","v":""},{"$f":"IF(JULY!N10=\"\",\"\",JULY!N10)","v":""},{"$f":"IF(JULY!O10=\"\",\"\",JULY!O10)","v":""},{"$f":"IF(JULY!P10=\"\",\"\",JULY!P10)","v":0},{"$f":"IF(JULY!Q10=\"\",\"\",JULY!Q10)","v":0},{"$f":"IF(JULY!R10=\"\",\"\",JULY!R10)","v":0},{"$f":"IF(JULY!S10=\"\",\"\",JULY!S10)","v":0},{"$f":"IF(JULY!T10=\"\",\"\",JULY!T10)","v":0},{"$f":"IF(JULY!U10=\"\",\"\",JULY!U10)","v":""},{"$f":"IF(JULY!V10=\"\",\"\",JULY!V10)","v":0}]
["AUG",31,{"$f":"IF(AUG!B6=\"\",\"\",AUG!B6)","v":0},{"$f":"IF(AUG!C6=\"\",\"\",AUG!C6)","v":0},{"$f":"IF(AUG!D6=\"\",\"\",AUG!D6)","v":0},{"$f":"IF(AUG!E6=\"\",\"\",AUG!E6)","v":""},{"$f":"IF(AUG!F6=\"\",\"\",AUG!F6)","v":0},{"$f":"IF(AUG!G6=\"\",\"\",AUG!G6)","v":0},{"$f":"IF(AUG!H6=\"\",\"\",AUG!H6)","v":""},{"$f":"IF(AUG!I6=\"\",\"\",AUG!I6)","v":0},{"$f":"IF(AUG!J6=\"\",\"\",AUG!J6)","v":""},{"$f":"IF(AUG!K6=\"\",\"\",AUG!K6)","v":""},{"$f":"IF(AUG!L6=\"\",\"\",AUG!L6)","v":""},{"$f":"IF(AUG!M6=\"\",\"\",AUG!M6)","v":""},{"$f":"IF(AUG!N6=\"\",\"\",AUG!N6)","v":""},{"$f":"IF(AUG!O6=\"\",\"\",AUG!O6)","v":""},{"$f":"IF(AUG!P6=\"\",\"\",AUG!P6)","v":0},{"$f":"IF(AUG!Q6=\"\",\"\",AUG!Q6)","v":0},{"$f":"IF(AUG!R6=\"\",\"\",AUG!R6)","v":0},{"$f":"IF(AUG!S6=\"\",\"\",AUG!S6)","v":0},{"$f":"IF(AUG!T6=\"\",\"\",AUG!T6)","v":0},{"$f":"IF(AUG!U6=\"\",\"\",AUG!U6)","v":""},{"$f":"IF(AUG!V6=\"\",\"\",AUG!V6)","v":0}]
[null,32,{"$f":"IF(AUG!B7=\"\",\"\",AUG!B7)","v":0},{"$f":"IF(AUG!C7=\"\",\"\",AUG!C7)","v":0},{"$f":"IF(AUG!D7=\"\",\"\",AUG!D7)","v":0},{"$f":"IF(AUG!E7=\"\",\"\",AUG!E7)","v":""},{"$f":"IF(AUG!F7=\"\",\"\",AUG!F7)","v":0},{"$f":"IF(AUG!G7=\"\",\"\",AUG!G7)","v":0},{"$f":"IF(AUG!H7=\"\",\"\",AUG!H7)","v":""},{"$f":"IF(AUG!I7=\"\",\"\",AUG!I7)","v":0},{"$f":"IF(AUG!J7=\"\",\"\",AUG!J7)","v":""},{"$f":"IF(AUG!K7=\"\",\"\",AUG!K7)","v":""},{"$f":"IF(AUG!L7=\"\",\"\",AUG!L7)","v":""},{"$f":"IF(AUG!M7=\"\",\"\",AUG!M7)","v":""},{"$f":"IF(AUG!N7=\"\",\"\",AUG!N7)","v":""},{"$f":"IF(AUG!O7=\"\",\"\",AUG!O7)","v":""},{"$f":"IF(AUG!P7=\"\",\"\",AUG!P7)","v":0},{"$f":"IF(AUG!Q7=\"\",\"\",AUG!Q7)","v":0},{"$f":"IF(AUG!R7=\"\",\"\",AUG!R7)","v":0},{"$f":"IF(AUG!S7=\"\",\"\",AUG!S7)","v":0},{"$f":"IF(AUG!T7=\"\",\"\",AUG!T7)","v":0},{"$f":"IF(AUG!U7=\"\",\"\",AUG!U7)","v":""},{"$f":"IF(AUG!V7=\"\",\"\",AUG!V7)","v":0}]
[null,33,{"$f":"IF(AUG!B8=\"\",\"\",AUG!B8)","v":0},{"$f":"IF(AUG!C8=\"\",\"\",AUG!C8)","v":0},{"$f":"IF(AUG!D8=\"\",\"\",AUG!D8)","v":0},{"$f":"IF(AUG!E8=\"\",\"\",AUG!E8)","v":""},{"$f":"IF(AUG!F8=\"\",\"\",AUG!F8)","v":0},{"$f":"IF(AUG!G8=\"\",\"\",AUG!G8)","v":0},{"$f":"IF(AUG!H8=\"\",\"\",AUG!H8)","v":""},{"$f":"IF(AUG!I8=\"\",\"\",AUG!I8)","v":0},{"$f":"IF(AUG!J8=\"\",\"\",AUG!J8)","v":""},{"$f":"IF(AUG!K8=\"\",\"\",AUG!K8)","v":""},{"$f":"IF(AUG!L8=\"\",\"\",AUG!L8)","v":""},{"$f":"IF(AUG!M8=\"\",\"\",AUG!M8)","v":""},{"$f":"IF(AUG!N8=\"\",\"\",AUG!N8)","v":""},{"$f":"IF(AUG!O8=\"\",\"\",AUG!O8)","v":""},{"$f":"IF(AUG!P8=\"\",\"\",AUG!P8)","v":0},{"$f":"IF(AUG!Q8=\"\",\"\",AUG!Q8)","v":0},{"$f":"IF(AUG!R8=\"\",\"\",AUG!R8)","v":0},{"$f":"IF(AUG!S8=\"\",\"\",AUG!S8)","v":0},{"$f":"IF(AUG!T8=\"\",\"\",AUG!T8)","v":0},{"$f":"IF(AUG!U8=\"\",\"\",AUG!U8)","v":""},{"$f":"IF(AUG!V8=\"\",\"\",AUG!V8)","v":0}]
[null,34,{"$f":"IF(AUG!B9=\"\",\"\",AUG!B9)","v":0},{"$f":"IF(AUG!C9=\"\",\"\",AUG!C9)","v":0},{"$f":"IF(AUG!D9=\"\",\"\",AUG!D9)","v":0},{"$f":"IF(AUG!E9=\"\",\"\",AUG!E9)","v":""},{"$f":"IF(AUG!F9=\"\",\"\",AUG!F9)","v":0},{"$f":"IF(AUG!G9=\"\",\"\",AUG!G9)","v":0},{"$f":"IF(AUG!H9=\"\",\"\",AUG!H9)","v":""},{"$f":"IF(AUG!I9=\"\",\"\",AUG!I9)","v":0},{"$f":"IF(AUG!J9=\"\",\"\",AUG!J9)","v":""},{"$f":"IF(AUG!K9=\"\",\"\",AUG!K9)","v":""},{"$f":"IF(AUG!L9=\"\",\"\",AUG!L9)","v":""},{"$f":"IF(AUG!M9=\"\",\"\",AUG!M9)","v":""},{"$f":"IF(AUG!N9=\"\",\"\",AUG!N9)","v":""},{"$f":"IF(AUG!O9=\"\",\"\",AUG!O9)","v":""},{"$f":"IF(AUG!P9=\"\",\"\",AUG!P9)","v":0},{"$f":"IF(AUG!Q9=\"\",\"\",AUG!Q9)","v":0},{"$f":"IF(AUG!R9=\"\",\"\",AUG!R9)","v":0},{"$f":"IF(AUG!S9=\"\",\"\",AUG!S9)","v":0},{"$f":"IF(AUG!T9=\"\",\"\",AUG!T9)","v":0},{"$f":"IF(AUG!U9=\"\",\"\",AUG!U9)","v":""},{"$f":"IF(AUG!V9=\"\",\"\",AUG!V9)","v":0}]
["SEPT",35,{"$f":"IF(SEPT!B6=\"\",\"\",SEPT!B6)","v":0},{"$f":"IF(SEPT!C6=\"\",\"\",SEPT!C6)","v":0},{"$f":"IF(SEPT!D6=\"\",\"\",SEPT!D6)","v":0},{"$f":"IF(SEPT!E6=\"\",\"\",SEPT!E6)","v":""},{"$f":"IF(SEPT!F6=\"\",\"\",SEPT!F6)","v":0},{"$f":"IF(SEPT!G6=\"\",\"\",SEPT!G6)","v":0},{"$f":"IF(SEPT!H6=\"\",\"\",SEPT!H6)","v":""},{"$f":"IF(SEPT!I6=\"\",\"\",SEPT!I6)","v":0},{"$f":"IF(SEPT!J6=\"\",\"\",SEPT!J6)","v":""},{"$f":"IF(SEPT!K6=\"\",\"\",SEPT!K6)","v":""},{"$f":"IF(SEPT!L6=\"\",\"\",SEPT!L6)","v":""},{"$f":"IF(SEPT!M6=\"\",\"\",SEPT!M6)","v":""},{"$f":"IF(SEPT!N6=\"\",\"\",SEPT!N6)","v":""},{"$f":"IF(SEPT!O6=\"\",\"\",SEPT!O6)","v":""},{"$f":"IF(SEPT!P6=\"\",\"\",SEPT!P6)","v":0},{"$f":"IF(SEPT!Q6=\"\",\"\",SEPT!Q6)","v":0},{"$f":"IF(SEPT!R6=\"\",\"\",SEPT!R6)","v":0},{"$f":"IF(SEPT!S6=\"\",\"\",SEPT!S6)","v":0},{"$f":"IF(SEPT!T6=\"\",\"\",SEPT!T6)","v":0},{"$f":"IF(SEPT!U6=\"\",\"\",SEPT!U6)","v":""},{"$f":"IF(SEPT!V6=\"\",\"\",SEPT!V6)","v":0}]
[null,36,{"$f":"IF(SEPT!B7=\"\",\"\",SEPT!B7)","v":0},{"$f":"IF(SEPT!C7=\"\",\"\",SEPT!C7)","v":0},{"$f":"IF(SEPT!D7=\"\",\"\",SEPT!D7)","v":0},{"$f":"IF(SEPT!E7=\"\",\"\",SEPT!E7)","v":""},{"$f":"IF(SEPT!F7=\"\",\"\",SEPT!F7)","v":0},{"$f":"IF(SEPT!G7=\"\",\"\",SEPT!G7)","v":0},{"$f":"IF(SEPT!H7=\"\",\"\",SEPT!H7)","v":""},{"$f":"IF(SEPT!I7=\"\",\"\",SEPT!I7)","v":0},{"$f":"IF(SEPT!J7=\"\",\"\",SEPT!J7)","v":""},{"$f":"IF(SEPT!K7=\"\",\"\",SEPT!K7)","v":""},{"$f":"IF(SEPT!L7=\"\",\"\",SEPT!L7)","v":""},{"$f":"IF(SEPT!M7=\"\",\"\",SEPT!M7)","v":""},{"$f":"IF(SEPT!N7=\"\",\"\",SEPT!N7)","v":""},{"$f":"IF(SEPT!O7=\"\",\"\",SEPT!O7)","v":""},{"$f":"IF(SEPT!P7=\"\",\"\",SEPT!P7)","v":0},{"$f":"IF(SEPT!Q7=\"\",\"\",SEPT!Q7)","v":0},{"$f":"IF(SEPT!R7=\"\",\"\",SEPT!R7)","v":0},{"$f":"IF(SEPT!S7=\"\",\"\",SEPT!S7)","v":0},{"$f":"IF(SEPT!T7=\"\",\"\",SEPT!T7)","v":0},{"$f":"IF(SEPT!U7=\"\",\"\",SEPT!U7)","v":""},{"$f":"IF(SEPT!V7=\"\",\"\",SEPT!V7)","v":0}]
[null,37,{"$f":"IF(SEPT!B8=\"\",\"\",SEPT!B8)","v":0},{"$f":"IF(SEPT!C8=\"\",\"\",SEPT!C8)","v":0},{"$f":"IF(SEPT!D8=\"\",\"\",SEPT!D8)","v":0},{"$f":"IF(SEPT!E8=\"\",\"\",SEPT!E8)","v":""},{"$f":"IF(SEPT!F8=\"\",\"\",SEPT!F8)","v":0},{"$f":"IF(SEPT!G8=\"\",\"\",SEPT!G8)","v":0},{"$f":"IF(SEPT!H8=\"\",\"\",SEPT!H8)","v":""},{"$f":"IF(SEPT!I8=\"\",\"\",SEPT!I8)","v":0},{"$f":"IF(SEPT!J8=\"\",\"\",SEPT!J8)","v":""},{"$f":"IF(SEPT!K8=\"\",\"\",SEPT!K8)","v":""},{"$f":"IF(SEPT!L8=\"\",\"\",SEPT!L8)","v":""},{"$f":"IF(SEPT!M8=\"\",\"\",SEPT!M8)","v":""},{"$f":"IF(SEPT!N8=\"\",\"\",SEPT!N8)","v":""},{"$f":"IF(SEPT!O8=\"\",\"\",SEPT!O8)","v":""},{"$f":"IF(SEPT!P8=\"\",\"\",SEPT!P8)","v":0},{"$f":"IF(SEPT!Q8=\"\",\"\",SEPT!Q8)","v":0},{"$f":"IF(SEPT!R8=\"\",\"\",SEPT!R8)","v":0},{"$f":"IF(SEPT!S8=\"\",\"\",SEPT!S8)","v":0},{"$f":"IF(SEPT!T8=\"\",\"\",SEPT!T8)","v":0},{"$f":"IF(SEPT!U8=\"\",\"\",SEPT!U8)","v":""},{"$f":"IF(SEPT!V8=\"\",\"\",SEPT!V8)","v":0}]
[null,38,{"$f":"IF(SEPT!B9=\"\",\"\",SEPT!B9)","v":0},{"$f":"IF(SEPT!C9=\"\",\"\",SEPT!C9)","v":0},{"$f":"IF(SEPT!D9=\"\",\"\",SEPT!D9)","v":0},{"$f":"IF(SEPT!E9=\"\",\"\",SEPT!E9)","v":""},{"$f":"IF(SEPT!F9=\"\",\"\",SEPT!F9)","v":0},{"$f":"IF(SEPT!G9=\"\",\"\",SEPT!G9)","v":0},{"$f":"IF(SEPT!H9=\"\",\"\",SEPT!H9)","v":""},{"$f":"IF(SEPT!I9=\"\",\"\",SEPT!I9)","v":0},{"$f":"IF(SEPT!J9=\"\",\"\",SEPT!J9)","v":""},{"$f":"IF(SEPT!K9=\"\",\"\",SEPT!K9)","v":""},{"$f":"IF(SEPT!L9=\"\",\"\",SEPT!L9)","v":""},{"$f":"IF(SEPT!M9=\"\",\"\",SEPT!M9)","v":""},{"$f":"IF(SEPT!N9=\"\",\"\",SEPT!N9)","v":""},{"$f":"IF(SEPT!O9=\"\",\"\",SEPT!O9)","v":""},{"$f":"IF(SEPT!P9=\"\",\"\",SEPT!P9)","v":0},{"$f":"IF(SEPT!Q9=\"\",\"\",SEPT!Q9)","v":0},{"$f":"IF(SEPT!R9=\"\",\"\",SEPT!R9)","v":0},{"$f":"IF(SEPT!S9=\"\",\"\",SEPT!S9)","v":0},{"$f":"IF(SEPT!T9=\"\",\"\",SEPT!T9)","v":0},{"$f":"IF(SEPT!U9=\"\",\"\",SEPT!U9)","v":""},{"$f":"IF(SEPT!V9=\"\",\"\",SEPT!V9)","v":0}]
[null,39,{"$f":"IF(SEPT!B10=\"\",\"\",SEPT!B10)","v":0},{"$f":"IF(SEPT!C10=\"\",\"\",SEPT!C10)","v":0},{"$f":"IF(SEPT!D10=\"\",\"\",SEPT!D10)","v":0},{"$f":"IF(SEPT!E10=\"\",\"\",SEPT!E10)","v":""},{"$f":"IF(SEPT!F10=\"\",\"\",SEPT!F10)","v":0},{"$f":"IF(SEPT!G10=\"\",\"\",SEPT!G10)","v":0},{"$f":"IF(SEPT!H10=\"\",\"\",SEPT!H10)","v":""},{"$f":"IF(SEPT!I10=\"\",\"\",SEPT!I10)","v":0},{"$f":"IF(SEPT!J10=\"\",\"\",SEPT!J10)","v":""},{"$f":"IF(SEPT!K10=\"\",\"\",SEPT!K10)","v":""},{"$f":"IF(SEPT!L10=\"\",\"\",SEPT!L10)","v":""},{"$f":"IF(SEPT!M10=\"\",\"\",SEPT!M10)","v":""},null,{"$f":"IF(SEPT!O10=\"\",\"\",SEPT!O10)","v":""},{"$f":"IF(SEPT!P10=\"\",\"\",SEPT!P10)","v":0},{"$f":"IF(SEPT!Q10=\"\",\"\",SEPT!Q10)","v":0},{"$f":"IF(SEPT!R10=\"\",\"\",SEPT!R10)","v":0},{"$f":"IF(SEPT!S10=\"\",\"\",SEPT!S10)","v":0},{"$f":"IF(SEPT!T10=\"\",\"\",SEPT!T10)","v":0},{"$f":"IF(SEPT!U10=\"\",\"\",SEPT!U10)","v":""},{"$f":"IF(SEPT!V10=\"\",\"\",SEPT!V10)","v":0}]
["OCT",40,{"$f":"IF(OCT!B6=\"\",\"\",OCT!B6)","v":0},{"$f":"IF(OCT!C6=\"\",\"\",OCT!C6)","v":0},{"$f":"IF(OCT!D6=\"\",\"\",OCT!D6)","v":0},{"$f":"IF(OCT!E6=\"\",\"\",OCT!E6)","v":""},{"$f":"IF(OCT!F6=\"\",\"\",OCT!F6)","v":0},{"$f":"IF(OCT!G6=\"\",\"\",OCT!G6)","v":0},{"$f":"IF(OCT!H6=\"\",\"\",OCT!H6)","v":""},{"$f":"IF(OCT!I6=\"\",\"\",OCT!I6)","v":0},{"$f":"IF(OCT!J6=\"\",\"\",OCT!J6)","v":""},{"$f":"IF(OCT!K6=\"\",\"\",OCT!K6)","v":""},{"$f":"IF(OCT!L6=\"\",\"\",OCT!L6)","v":""},{"$f":"IF(OCT!M6=\"\",\"\",OCT!M6)","v":""},{"$f":"IF(OCT!N6=\"\",\"\",OCT!N6)","v":""},{"$f":"IF(OCT!O6=\"\",\"\",OCT!O6)","v":""},{"$f":"IF(OCT!P6=\"\",\"\",OCT!P6)","v":0},{"$f":"IF(OCT!Q6=\"\",\"\",OCT!Q6)","v":0},{"$f":"IF(OCT!R6=\"\",\"\",OCT!R6)","v":0},{"$f":"IF(OCT!S6=\"\",\"\",OCT!S6)","v":0},{"$f":"IF(OCT!T6=\"\",\"\",OCT!T6)","v":0},{"$f":"IF(OCT!U6=\"\",\"\",OCT!U6)","v":""},{"$f":"IF(OCT!V6=\"\",\"\",OCT!V6)","v":0}]
[null,41,{"$f":"IF(OCT!B7=\"\",\"\",OCT!B7)","v":0},{"$f":"IF(OCT!C7=\"\",\"\",OCT!C7)","v":0},{"$f":"IF(OCT!D7=\"\",\"\",OCT!D7)","v":0},{"$f":"IF(OCT!E7=\"\",\"\",OCT!E7)","v":""},{"$f":"IF(OCT!F7=\"\",\"\",OCT!F7)","v":0},{"$f":"IF(OCT!G7=\"\",\"\",OCT!G7)","v":0},{"$f":"IF(OCT!H7=\"\",\"\",OCT!H7)","v":""},{"$f":"IF(OCT!I7=\"\",\"\",OCT!I7)","v":0},{"$f":"IF(OCT!J7=\"\",\"\",OCT!J7)","v":""},{"$f":"IF(OCT!K7=\"\",\"\",OCT!K7)","v":""},{"$f":"IF(OCT!L7=\"\",\"\",OCT!L7)","v":""},{"$f":"IF(OCT!M7=\"\",\"\",OCT!M7)","v":""},{"$f":"IF(OCT!N7=\"\",\"\",OCT!N7)","v":""},{"$f":"IF(OCT!O7=\"\",\"\",OCT!O7)","v":""},{"$f":"IF(OCT!P7=\"\",\"\",OCT!P7)","v":0},{"$f":"IF(OCT!Q7=\"\",\"\",OCT!Q7)","v":0},{"$f":"IF(OCT!R7=\"\",\"\",OCT!R7)","v":0},{"$f":"IF(OCT!S7=\"\",\"\",OCT!S7)","v":0},{"$f":"IF(OCT!T7=\"\",\"\",OCT!T7)","v":0},{"$f":"IF(OCT!U7=\"\",\"\",OCT!U7)","v":""},{"$f":"IF(OCT!V7=\"\",\"\",OCT!V7)","v":0}]
[null,42,{"$f":"IF(OCT!B8=\"\",\"\",OCT!B8)","v":0},{"$f":"IF(OCT!C8=\"\",\"\",OCT!C8)","v":0},{"$f":"IF(OCT!D8=\"\",\"\",OCT!D8)","v":0},{"$f":"IF(OCT!E8=\"\",\"\",OCT!E8)","v":""},{"$f":"IF(OCT!F8=\"\",\"\",OCT!F8)","v":0},{"$f":"IF(OCT!G8=\"\",\"\",OCT!G8)","v":0},{"$f":"IF(OCT!H8=\"\",\"\",OCT!H8)","v":""},{"$f":"IF(OCT!I8=\"\",\"\",OCT!I8)","v":0},{"$f":"IF(OCT!J8=\"\",\"\",OCT!J8)","v":""},{"$f":"IF(OCT!K8=\"\",\"\",OCT!K8)","v":""},{"$f":"IF(OCT!L8=\"\",\"\",OCT!L8)","v":""},{"$f":"IF(OCT!M8=\"\",\"\",OCT!M8)","v":""},{"$f":"IF(OCT!N8=\"\",\"\",OCT!N8)","v":""},{"$f":"IF(OCT!O8=\"\",\"\",OCT!O8)","v":""},{"$f":"IF(OCT!P8=\"\",\"\",OCT!P8)","v":0},{"$f":"IF(OCT!Q8=\"\",\"\",OCT!Q8)","v":0},{"$f":"IF(OCT!R8=\"\",\"\",OCT!R8)","v":0},{"$f":"IF(OCT!S8=\"\",\"\",OCT!S8)","v":0},{"$f":"IF(OCT!T8=\"\",\"\",OCT!T8)","v":0},{"$f":"IF(OCT!U8=\"\",\"\",OCT!U8)","v":""},{"$f":"IF(OCT!V8=\"\",\"\",OCT!V8)","v":0}]
[null,43,{"$f":"IF(OCT!B9=\"\",\"\",OCT!B9)","v":0},{"$f":"IF(OCT!C9=\"\",\"\",OCT!C9)","v":0},{"$f":"IF(OCT!D9=\"\",\"\",OCT!D9)","v":0},{"$f":"IF(OCT!E9=\"\",\"\",OCT!E9)","v":""},{"$f":"IF(OCT!F9=\"\",\"\",OCT!F9)","v":0},{"$f":"IF(OCT!G9=\"\",\"\",OCT!G9)","v":0},{"$f":"IF(OCT!H9=\"\",\"\",OCT!H9)","v":""},{"$f":"IF(OCT!I9=\"\",\"\",OCT!I9)","v":0},{"$f":"IF(OCT!J9=\"\",\"\",OCT!J9)","v":""},{"$f":"IF(OCT!K9=\"\",\"\",OCT!K9)","v":""},{"$f":"IF(OCT!L9=\"\",\"\",OCT!L9)","v":""},{"$f":"IF(OCT!M9=\"\",\"\",OCT!M9)","v":""},{"$f":"IF(OCT!N9=\"\",\"\",OCT!N9)","v":""},{"$f":"IF(OCT!O9=\"\",\"\",OCT!O9)","v":""},{"$f":"IF(OCT!P9=\"\",\"\",OCT!P9)","v":0},{"$f":"IF(OCT!Q9=\"\",\"\",OCT!Q9)","v":0},{"$f":"IF(OCT!R9=\"\",\"\",OCT!R9)","v":0},{"$f":"IF(OCT!S9=\"\",\"\",OCT!S9)","v":0},{"$f":"IF(OCT!T9=\"\",\"\",OCT!T9)","v":0},{"$f":"IF(OCT!U9=\"\",\"\",OCT!U9)","v":""},{"$f":"IF(OCT!V9=\"\",\"\",OCT!V9)","v":0}]
["NOV",44,{"$f":"IF(NOV!B6=\"\",\"\",NOV!B6)","v":0},{"$f":"IF(NOV!C6=\"\",\"\",NOV!C6)","v":0},{"$f":"IF(NOV!D6=\"\",\"\",NOV!D6)","v":0},{"$f":"IF(NOV!E6=\"\",\"\",NOV!E6)","v":""},{"$f":"IF(NOV!F6=\"\",\"\",NOV!F6)","v":0},{"$f":"IF(NOV!G6=\"\",\"\",NOV!G6)","v":0},{"$f":"IF(NOV!H6=\"\",\"\",NOV!H6)","v":""},{"$f":"IF(NOV!I6=\"\",\"\",NOV!I6)","v":0},{"$f":"IF(NOV!J6=\"\",\"\",NOV!J6)","v":""},{"$f":"IF(NOV!K6=\"\",\"\",NOV!K6)","v":""},{"$f":"IF(NOV!L6=\"\",\"\",NOV!L6)","v":""},{"$f":"IF(NOV!M6=\"\",\"\",NOV!M6)","v":""},{"$f":"IF(NOV!N6=\"\",\"\",NOV!N6)","v":""},{"$f":"IF(NOV!O6=\"\",\"\",NOV!O6)","v":""},{"$f":"IF(NOV!P6=\"\",\"\",NOV!P6)","v":0},{"$f":"IF(NOV!Q6=\"\",\"\",NOV!Q6)","v":0},{"$f":"IF(NOV!R6=\"\",\"\",NOV!R6)","v":0},{"$f":"IF(NOV!S6=\"\",\"\",NOV!S6)","v":0},{"$f":"IF(NOV!T6=\"\",\"\",NOV!T6)","v":0},{"$f":"IF(NOV!U6=\"\",\"\",NOV!U6)","v":""},{"$f":"IF(NOV!V6=\"\",\"\",NOV!V6)","v":0}]
[null,45,{"$f":"IF(NOV!B7=\"\",\"\",NOV!B7)","v":0},{"$f":"IF(NOV!C7=\"\",\"\",NOV!C7)","v":0},{"$f":"IF(NOV!D7=\"\",\"\",NOV!D7)","v":0},{"$f":"IF(NOV!E7=\"\",\"\",NOV!E7)","v":""},{"$f":"IF(NOV!F7=\"\",\"\",NOV!F7)","v":0},{"$f":"IF(NOV!G7=\"\",\"\",NOV!G7)","v":0},{"$f":"IF(NOV!H7=\"\",\"\",NOV!H7)","v":""},{"$f":"IF(NOV!I7=\"\",\"\",NOV!I7)","v":0},{"$f":"IF(NOV!J7=\"\",\"\",NOV!J7)","v":""},{"$f":"IF(NOV!K7=\"\",\"\",NOV!K7)","v":""},{"$f":"IF(NOV!L7=\"\",\"\",NOV!L7)","v":""},{"$f":"IF(NOV!M7=\"\",\"\",NOV!M7)","v":""},{"$f":"IF(NOV!N7=\"\",\"\",NOV!N7)","v":""},{"$f":"IF(NOV!O7=\"\",\"\",NOV!O7)","v":""},{"$f":"IF(NOV!P7=\"\",\"\",NOV!P7)","v":0},{"$f":"IF(NOV!Q7=\"\",\"\",NOV!Q7)","v":0},{"$f":"IF(NOV!R7=\"\",\"\",NOV!R7)","v":0},{"$f":"IF(NOV!S7=\"\",\"\",NOV!S7)","v":0},{"$f":"IF(NOV!T7=\"\",\"\",NOV!T7)","v":0},{"$f":"IF(NOV!U7=\"\",\"\",NOV!U7)","v":""},{"$f":"IF(NOV!V7=\"\",\"\",NOV!V7)","v":0}]
[null,46,{"$f":"IF(NOV!B8=\"\",\"\",NOV!B8)","v":0},{"$f":"IF(NOV!C8=\"\",\"\",NOV!C8)","v":0},{"$f":"IF(NOV!D8=\"\",\"\",NOV!D8)","v":0},{"$f":"IF(NOV!E8=\"\",\"\",NOV!E8)","v":""},{"$f":"IF(NOV!F8=\"\",\"\",NOV!F8)","v":0},{"$f":"IF(NOV!G8=\"\",\"\",NOV!G8)","v":0},{"$f":"IF(NOV!H8=\"\",\"\",NOV!H8)","v":""},{"$f":"IF(NOV!I8=\"\",\"\",NOV!I8)","v":0},{"$f":"IF(NOV!J8=\"\",\"\",NOV!J8)","v":""},{"$f":"IF(NOV!K8=\"\",\"\",NOV!K8)","v":""},{"$f":"IF(NOV!L8=\"\",\"\",NOV!L8)","v":""},{"$f":"IF(NOV!M8=\"\",\"\",NOV!M8)","v":""},{"$f":"IF(NOV!N8=\"\",\"\",NOV!N8)","v":""},{"$f":"IF(NOV!O8=\"\",\"\",NOV!O8)","v":""},{"$f":"IF(NOV!P8=\"\",\"\",NOV!P8)","v":0},{"$f":"IF(NOV!Q8=\"\",\"\",NOV!Q8)","v":0},{"$f":"IF(NOV!R8=\"\",\"\",NOV!R8)","v":0},{"$f":"IF(NOV!S8=\"\",\"\",NOV!S8)","v":0},{"$f":"IF(NOV!T8=\"\",\"\",NOV!T8)","v":0},{"$f":"IF(NOV!U8=\"\",\"\",NOV!U8)","v":""},{"$f":"IF(NOV!V8=\"\",\"\",NOV!V8)","v":0}]
[null,47,{"$f":"IF(NOV!B9=\"\",\"\",NOV!B9)","v":0},{"$f":"IF(NOV!C9=\"\",\"\",NOV!C9)","v":0},{"$f":"IF(NOV!D9=\"\",\"\",NOV!D9)","v":0},{"$f":"IF(NOV!E9=\"\",\"\",NOV!E9)","v":""},{"$f":"IF(NOV!F9=\"\",\"\",NOV!F9)","v":0},{"$f":"IF(NOV!G9=\"\",\"\",NOV!G9)","v":0},{"$f":"IF(NOV!H9=\"\",\"\",NOV!H9)","v":""},{"$f":"IF(NOV!I9=\"\",\"\",NOV!I9)","v":0},{"$f":"IF(NOV!J9=\"\",\"\",NOV!J9)","v":""},{"$f":"IF(NOV!K9=\"\",\"\",NOV!K9)","v":""},{"$f":"IF(NOV!L9=\"\",\"\",NOV!L9)","v":""},{"$f":"IF(NOV!M9=\"\",\"\",NOV!M9)","v":""},{"$f":"IF(NOV!N9=\"\",\"\",NOV!N9)","v":""},{"$f":"IF(NOV!O9=\"\",\"\",NOV!O9)","v":""},{"$f":"IF(NOV!P9=\"\",\"\",NOV!P9)","v":0},{"$f":"IF(NOV!Q9=\"\",\"\",NOV!Q9)","v":0},{"$f":"IF(NOV!R9=\"\",\"\",NOV!R9)","v":0},{"$f":"IF(NOV!S9=\"\",\"\",NOV!S9)","v":0},{"$f":"IF(NOV!T9=\"\",\"\",NOV!T9)","v":0},{"$f":"IF(NOV!U9=\"\",\"\",NOV!U9)","v":""},{"$f":"IF(NOV!V9=\"\",\"\",NOV!V9)","v":0}]
["DEC",48,{"$f":"IF(DEC!B6=\"\",\"\",DEC!B6)","v":0},{"$f":"IF(DEC!C6=\"\",\"\",DEC!C6)","v":0},{"$f":"IF(DEC!D6=\"\",\"\",DEC!D6)","v":0},{"$f":"IF(DEC!E6=\"\",\"\",DEC!E6)","v":""},{"$f":"IF(DEC!F6=\"\",\"\",DEC!F6)","v":0},{"$f":"IF(DEC!G6=\"\",\"\",DEC!G6)","v":0},{"$f":"IF(DEC!H6=\"\",\"\",DEC!H6)","v":""},{"$f":"IF(DEC!I6=\"\",\"\",DEC!I6)","v":0},{"$f":"IF(DEC!J6=\"\",\"\",DEC!J6)","v":""},{"$f":"IF(DEC!K6=\"\",\"\",DEC!K6)","v":""},{"$f":"IF(DEC!L6=\"\",\"\",DEC!L6)","v":""},{"$f":"IF(DEC!M6=\"\",\"\",DEC!M6)","v":""},{"$f":"IF(DEC!N6=\"\",\"\",DEC!N6)","v":""},{"$f":"IF(DEC!O6=\"\",\"\",DEC!O6)","v":""},{"$f":"IF(DEC!P6=\"\",\"\",DEC!P6)","v":0},{"$f":"IF(DEC!Q6=\"\",\"\",DEC!Q6)","v":0},{"$f":"IF(DEC!R6=\"\",\"\",DEC!R6)","v":0},{"$f":"IF(DEC!S6=\"\",\"\",DEC!S6)","v":0},{"$f":"IF(DEC!T6=\"\",\"\",DEC!T6)","v":0},{"$f":"IF(DEC!U6=\"\",\"\",DEC!U6)","v":""},{"$f":"IF(DEC!V6=\"\",\"\",DEC!V6)","v":0}]
[null,49,{"$f":"IF(DEC!B7=\"\",\"\",DEC!B7)","v":0},{"$f":"IF(DEC!C7=\"\",\"\",DEC!C7)","v":0},{"$f":"IF(DEC!D7=\"\",\"\",DEC!D7)","v":0},{"$f":"IF(DEC!E7=\"\",\"\",DEC!E7)","v":""},{"$f":"IF(DEC!F7=\"\",\"\",DEC!F7)","v":0},{"$f":"IF(DEC!G7=\"\",\"\",DEC!G7)","v":0},{"$f":"IF(DEC!H7=\"\",\"\",DEC!H7)","v":""},{"$f":"IF(DEC!I7=\"\",\"\",DEC!I7)","v":0},{"$f":"IF(DEC!J7=\"\",\"\",DEC!J7)","v":""},{"$f":"IF(DEC!K7=\"\",\"\",DEC!K7)","v":""},{"$f":"IF(DEC!L7=\"\",\"\",DEC!L7)","v":""},{"$f":"IF(DEC!M7=\"\",\"\",DEC!M7)","v":""},{"$f":"IF(DEC!N7=\"\",\"\",DEC!N7)","v":""},{"$f":"IF(DEC!O7=\"\",\"\",DEC!O7)","v":""},{"$f":"IF(DEC!P7=\"\",\"\",DEC!P7)","v":0},{"$f":"IF(DEC!Q7=\"\",\"\",DEC!Q7)","v":0},{"$f":"IF(DEC!R7=\"\",\"\",DEC!R7)","v":0},{"$f":"IF(DEC!S7=\"\",\"\",DEC!S7)","v":0},{"$f":"IF(DEC!T7=\"\",\"\",DEC!T7)","v":0},{"$f":"IF(DEC!U7=\"\",\"\",DEC!U7)","v":""},{"$f":"IF(DEC!V7=\"\",\"\",DEC!V7)","v":0}]
[null,50,{"$f":"IF(DEC!B8=\"\",\"\",DEC!B8)","v":0},{"$f":"IF(DEC!C8=\"\",\"\",DEC!C8)","v":0},{"$f":"IF(DEC!D8=\"\",\"\",DEC!D8)","v":0},{"$f":"IF(DEC!E8=\"\",\"\",DEC!E8)","v":""},{"$f":"IF(DEC!F8=\"\",\"\",DEC!F8)","v":0},{"$f":"IF(DEC!G8=\"\",\"\",DEC!G8)","v":0},{"$f":"IF(DEC!H8=\"\",\"\",DEC!H8)","v":""},{"$f":"IF(DEC!I8=\"\",\"\",DEC!I8)","v":0},{"$f":"IF(DEC!J8=\"\",\"\",DEC!J8)","v":""},{"$f":"IF(DEC!K8=\"\",\"\",DEC!K8)","v":""},{"$f":"IF(DEC!L8=\"\",\"\",DEC!L8)","v":""},{"$f":"IF(DEC!M8=\"\",\"\",DEC!M8)","v":""},{"$f":"IF(DEC!N8=\"\",\"\",DEC!N8)","v":""},{"$f":"IF(DEC!O8=\"\",\"\",DEC!O8)","v":""},{"$f":"IF(DEC!P8=\"\",\"\",DEC!P8)","v":0},{"$f":"IF(DEC!Q8=\"\",\"\",DEC!Q8)","v":0},{"$f":"IF(DEC!R8=\"\",\"\",DEC!R8)","v":0},{"$f":"IF(DEC!S8=\"\",\"\",DEC!S8)","v":0},{"$f":"IF(DEC!T8=\"\",\"\",DEC!T8)","v":0},{"$f":"IF(DEC!U8=\"\",\"\",DEC!U8)","v":""},{"$f":"IF(DEC!V8=\"\",\"\",DEC!V8)","v":0}]
[null,51,{"$f":"IF(DEC!B9=\"\",\"\",DEC!B9)","v":0},{"$f":"IF(DEC!C9=\"\",\"\",DEC!C9)","v":0},{"$f":"IF(DEC!D9=\"\",\"\",DEC!D9)","v":0},{"$f":"IF(DEC!E9=\"\",\"\",DEC!E9)","v":""},{"$f":"IF(DEC!F9=\"\",\"\",DEC!F9)","v":0},{"$f":"IF(DEC!G9=\"\",\"\",DEC!G9)","v":0},{"$f":"IF(DEC!H9=\"\",\"\",DEC!H9)","v":""},{"$f":"IF(DEC!I9=\"\",\"\",DEC!I9)","v":0},{"$f":"IF(DEC!J9=\"\",\"\",DEC!J9)","v":""},{"$f":"IF(DEC!K9=\"\",\"\",DEC!K9)","v":""},{"$f":"IF(DEC!L9=\"\",\"\",DEC!L9)","v":""},{"$f":"IF(DEC!M9=\"\",\"\",DEC!M9)","v":""},{"$f":"IF(DEC!N9=\"\",\"\",DEC!N9)","v":""},{"$f":"IF(DEC!O9=\"\",\"\",DEC!O9)","v":""},{"$f":"IF(DEC!P9=\"\",\"\",DEC!P9)","v":0},{"$f":"IF(DEC!Q9=\"\",\"\",DEC!Q9)","v":0},{"$f":"IF(DEC!R9=\"\",\"\",DEC!R9)","v":0},{"$f":"IF(DEC!S9=\"\",\"\",DEC!S9)","v":0},{"$f":"IF(DEC!T9=\"\",\"\",DEC!T9)","v":0},{"$f":"IF(DEC!U9=\"\",\"\",DEC!U9)","v":""},{"$f":"IF(DEC!V9=\"\",\"\",DEC!V9)","v":0}]
[null,52,{"$f":"IF(DEC!B10=\"\",\"\",DEC!B10)","v":0},{"$f":"IF(DEC!C10=\"\",\"\",DEC!C10)","v":0},{"$f":"IF(DEC!D10=\"\",\"\",DEC!D10)","v":0},{"$f":"IF(DEC!E10=\"\",\"\",DEC!E10)","v":""},{"$f":"IF(DEC!F10=\"\",\"\",DEC!F10)","v":0},{"$f":"IF(DEC!G10=\"\",\"\",DEC!G10)","v":0},{"$f":"IF(DEC!H10=\"\",\"\",DEC!H10)","v":""},{"$f":"IF(DEC!I10=\"\",\"\",DEC!I10)","v":0},{"$f":"IF(DEC!J10=\"\",\"\",DEC!J10)","v":""},{"$f":"IF(DEC!K10=\"\",\"\",DEC!K10)","v":""},{"$f":"IF(DEC!L10=\"\",\"\",DEC!L10)","v":""},{"$f":"IF(DEC!M10=\"\",\"\",DEC!M10)","v":""},{"$f":"IF(DEC!N10=\"\",\"\",DEC!N10)","v":""},{"$f":"IF(DEC!O10=\"\",\"\",DEC!O10)","v":""},{"$f":"IF(DEC!P10=\"\",\"\",DEC!P10)","v":0},{"$f":"IF(DEC!Q10=\"\",\"\",DEC!Q10)","v":0},{"$f":"IF(DEC!R10=\"\",\"\",DEC!R10)","v":0},{"$f":"IF(DEC!S10=\"\",\"\",DEC!S10)","v":0},{"$f":"IF(DEC!T10=\"\",\"\",DEC!T10)","v":0},{"$f":"IF(DEC!U10=\"\",\"\",DEC!U10)","v":""},{"$f":"IF(DEC!V10=\"\",\"\",DEC!V10)","v":0}]
[]
[]
[null,"MONTHLY AVERAGES"]
[null,{"$f":"B5","v":"Week"},{"$f":"C26","v":"Worship Attend"},"","","Giving","","","SG or Other","Youth Group","Conversions","Baptisms","Growth decisions","Members Added"]
[null,"JAN",{"$f":"IF(SUM(C27:C30)=0,\"\",(SUM(C27:C30)/(COUNTIF(C27:C30,\">0\"))))","v":""},"","","","","","","",{"$f":"IF(SUM(K27:K30)=0,\"\",SUM(K27:K30))","v":""},{"$f":"IF(SUM(L27:L30)=0,\"\",SUM(L27:L30))","v":""},{"$f":"IF(SUM(M27:M30)=0,\"\",SUM(M27:M30))","v":""},{"$f":"IF(SUM(N27:N30)=0,\"\",SUM(N27:N30))","v":""}]
[null,"FEB",{"$f":"IF(SUM(C31:C34)=0,\"\",(SUM(C31:C34)/(COUNTIF(C31:C34,\">0\"))))","v":""},{"$f":"IF(SUM(D31:D34)=0,\"\",(SUM(D31:D34)/(COUNTIF(D31:D34,\">0\"))))","v":""},{"$f":"IF(SUM(E31:E34)=0,\"\",(SUM(E31:E34)/(COUNTIF(E31:E34,\">0\"))))","v":""},{"$f":"IF(SUM(F31:F34)=0,\"\",(SUM(F31:F34)/(COUNTIF(F31:F34,\">0\"))))","v":""},{"$f":"IF(SUM(G31:G34)=0,\"\",(SUM(G31:G34)/(COUNTIF(G31:G34,\">0\"))))","v":""},{"$f":"IF(SUM(H28:H31)=0,\"\",(SUM(H28:H31)/(COUNTIF(H28:H31,\">0\"))))","v":""},{"$f":"IF(SUM(I31:I34)=0,\"\",(SUM(I31:I34)/(COUNTIF(I31:I34,\">0\"))))","v":""},{"$f":"IF(SUM(J31:J34)=0,\"\",(SUM(J31:J34)/(COUNTIF(J31:J34,\">0\"))))","v":""},{"$f":"IF(SUM(K31:K34)=0,\"\",SUM(K31:K34))","v":""},{"$f":"IF(SUM(L31:L34)=0,\"\",SUM(L31:L34))","v":""},{"$f":"IF(SUM(M31:M34)=0,\"\",SUM(M31:M34))","v":""},{"$f":"IF(SUM(N31:N34)=0,\"\",SUM(N31:N34))","v":""}]
[null,"MAR",{"$f":"IF(SUM(C35:C38)=0,\"\",(SUM(C35:C38)/(COUNTIF(C35:C38,\">0\"))))","v":""},{"$f":"IF(SUM(D35:D38)=0,\"\",(SUM(D35:D38)/(COUNTIF(D35:D38,\">0\"))))","v":""},{"$f":"IF(SUM(E35:E38)=0,\"\",(SUM(E35:E38)/(COUNTIF(E35:E38,\">0\"))))","v":""},{"$f":"IF(SUM(F35:F38)=0,\"\",(SUM(F35:F38)/(COUNTIF(F35:F38,\">0\"))))","v":""},{"$f":"IF(SUM(G35:G38)=0,\"\",(SUM(G35:G38)/(COUNTIF(G35:G38,\">0\"))))","v":""},{"$f":"IF(SUM(H29:H32)=0,\"\",(SUM(H29:H32)/(COUNTIF(H29:H32,\">0\"))))","v":""},{"$f":"IF(SUM(I35:I38)=0,\"\",(SUM(I35:I38)/(COUNTIF(I35:I38,\">0\"))))","v":""},{"$f":"IF(SUM(J35:J38)=0,\"\",(SUM(J35:J38)/(COUNTIF(J35:J38,\">0\"))))","v":""},{"$f":"IF(SUM(K35:K38)=0,\"\",SUM(K35:K38))","v":""},{"$f":"IF(SUM(L35:L38)=0,\"\",SUM(L35:L38))","v":""},{"$f":"IF(SUM(M35:M38)=0,\"\",SUM(M35:M38))","v":""},{"$f":"IF(SUM(N35:N38)=0,\"\",SUM(N35:N38))","v":""}]
[null,"APR",{"$f":"IF(SUM(C39:C43)=0,\"\",(SUM(C39:C43)/(COUNTIF(C39:C43,\">0\"))))","v":""},{"$f":"IF(SUM(D39:D43)=0,\"\",(SUM(D39:D43)/(COUNTIF(D39:D43,\">0\"))))","v":""},{"$f":"IF(SUM(E39:E43)=0,\"\",(SUM(E39:E43)/(COUNTIF(E39:E43,\">0\"))))","v":""},{"$f":"IF(SUM(F39:F43)=0,\"\",(SUM(F39:F43)/(COUNTIF(F39:F43,\">0\"))))","v":""},{"$f":"IF(SUM(G39:G43)=0,\"\",(SUM(G39:G43)/(COUNTIF(G39:G43,\">0\"))))","v":""},{"$f":"IF(SUM(H30:H33)=0,\"\",(SUM(H30:H33)/(COUNTIF(H30:H33,\">0\"))))","v":""},{"$f":"IF(SUM(I39:I43)=0,\"\",(SUM(I39:I43)/(COUNTIF(I39:I43,\">0\"))))","v":""},{"$f":"IF(SUM(J39:J43)=0,\"\",(SUM(J39:J43)/(COUNTIF(J39:J43,\">0\"))))","v":""},{"$f":"IF(SUM(K39:K43)=0,\"\",SUM(K39:K43))","v":""},{"$f":"IF(SUM(L39:L43)=0,\"\",SUM(L39:L43))","v":""},{"$f":"IF(SUM(M39:M43)=0,\"\",SUM(M39:M43))","v":""},{"$f":"IF(SUM(N39:N43)=0,\"\",SUM(N39:N43))","v":""}]
[null,"MAY",{"$f":"IF(SUM(C44:C47)=0,\"\",(SUM(C44:C47)/(COUNTIF(C44:C47,\">0\"))))","v":""},{"$f":"IF(SUM(D44:D47)=0,\"\",(SUM(D44:D47)/(COUNTIF(D44:D47,\">0\"))))","v":""},{"$f":"IF(SUM(E44:E47)=0,\"\",(SUM(E44:E47)/(COUNTIF(E44:E47,\">0\"))))","v":""},{"$f":"IF(SUM(F44:F47)=0,\"\",(SUM(F44:F47)/(COUNTIF(F44:F47,\">0\"))))","v":""},{"$f":"IF(SUM(G44:G47)=0,\"\",(SUM(G44:G47)/(COUNTIF(G44:G47,\">0\"))))","v":""},{"$f":"IF(SUM(H31:H34)=0,\"\",(SUM(H31:H34)/(COUNTIF(H31:H34,\">0\"))))","v":""},{"$f":"IF(SUM(I44:I47)=0,\"\",(SUM(I44:I47)/(COUNTIF(I44:I47,\">0\"))))","v":""},{"$f":"IF(SUM(J44:J47)=0,\"\",(SUM(J44:J47)/(COUNTIF(J44:J47,\">0\"))))","v":""},{"$f":"IF(SUM(K44:K47)=0,\"\",SUM(K44:K47))","v":""},{"$f":"IF(SUM(L44:L47)=0,\"\",SUM(L44:L47))","v":""},{"$f":"IF(SUM(M44:M47)=0,\"\",SUM(M44:M47))","v":""},{"$f":"IF(SUM(N44:N47)=0,\"\",SUM(N44:N47))","v":""}]
[null,"JUNE",{"$f":"IF(SUM(C48:C51)=0,\"\",(SUM(C48:C51)/(COUNTIF(C48:C51,\">0\"))))","v":""},{"$f":"IF(SUM(D48:D51)=0,\"\",(SUM(D48:D51)/(COUNTIF(D48:D51,\">0\"))))","v":""},{"$f":"IF(SUM(E48:E51)=0,\"\",(SUM(E48:E51)/(COUNTIF(E48:E51,\">0\"))))","v":""},{"$f":"IF(SUM(F48:F51)=0,\"\",(SUM(F48:F51)/(COUNTIF(F48:F51,\">0\"))))","v":""},{"$f":"IF(SUM(G48:G51)=0,\"\",(SUM(G48:G51)/(COUNTIF(G48:G51,\">0\"))))","v":""},{"$f":"IF(SUM(H31:H35)=0,\"\",(SUM(H31:H35)/(COUNTIF(H31:H35,\">0\"))))","v":""},{"$f":"IF(SUM(I48:I51)=0,\"\",(SUM(I48:I51)/(COUNTIF(I48:I51,\">0\"))))","v":""},{"$f":"IF(SUM(J48:J51)=0,\"\",(SUM(J48:J51)/(COUNTIF(J48:J51,\">0\"))))","v":""},{"$f":"IF(SUM(K48:K51)=0,\"\",SUM(K48:K51))","v":""},{"$f":"IF(SUM(L48:L51)=0,\"\",SUM(L48:L51))","v":""},{"$f":"IF(SUM(M48:M51)=0,\"\",SUM(M48:M51))","v":""},{"$f":"IF(SUM(N48:N51)=0,\"\",SUM(N48:N51))","v":""}]
[null,"JULY",{"$f":"IF(SUM(C52:C56)=0,\"\",(SUM(C52:C56)/(COUNTIF(C52:C56,\">0\"))))","v":""},{"$f":"IF(SUM(D52:D56)=0,\"\",(SUM(D52:D56)/(COUNTIF(D52:D56,\">0\"))))","v":""},{"$f":"IF(SUM(E52:E56)=0,\"\",(SUM(E52:E56)/(COUNTIF(E52:E56,\">0\"))))","v":""},{"$f":"IF(SUM(F52:F56)=0,\"\",(SUM(F52:F56)/(COUNTIF(F52:F56,\">0\"))))","v":""},{"$f":"IF(SUM(G52:G56)=0,\"\",(SUM(G52:G56)/(COUNTIF(G52:G56,\">0\"))))","v":""},"",{"$f":"IF(SUM(I52:I56)=0,\"\",(SUM(I52:I56)/(COUNTIF(I52:I56,\">0\"))))","v":""},{"$f":"IF(SUM(J52:J56)=0,\"\",(SUM(J52:J56)/(COUNTIF(J52:J56,\">0\"))))","v":""},{"$f":"IF(SUM(K52:K56)=0,\"\",SUM(K52:K56))","v":""},{"$f":"IF(SUM(L52:L56)=0,\"\",SUM(L52:L56))","v":""},{"$f":"IF(SUM(M52:M56)=0,\"\",SUM(M52:M56))","v":""},{"$f":"IF(SUM(N52:N56)=0,\"\",SUM(N52:N56))","v":""}]
[null,"AUG",{"$f":"IF(SUM(C57:C60)=0,\"\",(SUM(C57:C60)/(COUNTIF(C57:C60,\">0\"))))","v":""},{"$f":"IF(SUM(D57:D60)=0,\"\",(SUM(D57:D60)/(COUNTIF(D57:D60,\">0\"))))","v":""},{"$f":"IF(SUM(E57:E60)=0,\"\",(SUM(E57:E60)/(COUNTIF(E57:E60,\">0\"))))","v":""},{"$f":"IF(SUM(F57:F60)=0,\"\",(SUM(F57:F60)/(COUNTIF(F57:F60,\">0\"))))","v":""},{"$f":"IF(SUM(G57:G60)=0,\"\",(SUM(G57:G60)/(COUNTIF(G57:G60,\">0\"))))","v":""},"",{"$f":"IF(SUM(I57:I60)=0,\"\",(SUM(I57:I60)/(COUNTIF(I57:I60,\">0\"))))","v":""},{"$f":"IF(SUM(J57:J60)=0,\"\",(SUM(J57:J60)/(COUNTIF(J57:J60,\">0\"))))","v":""},{"$f":"IF(SUM(K57:K60)=0,\"\",SUM(K57:K60))","v":""},{"$f":"IF(SUM(L57:L60)=0,\"\",SUM(L57:L60))","v":""},{"$f":"IF(SUM(M57:M60)=0,\"\",SUM(M57:M60))","v":""},{"$f":"IF(SUM(N57:N60)=0,\"\",SUM(N57:N60))","v":""}]
[null,"SEP",{"$f":"IF(SUM(C61:C64)=0,\"\",(SUM(C61:C64)/(COUNTIF(C61:C64,\">0\"))))","v":""},{"$f":"IF(SUM(D61:D64)=0,\"\",(SUM(D61:D64)/(COUNTIF(D61:D64,\">0\"))))","v":""},{"$f":"IF(SUM(E61:E64)=0,\"\",(SUM(E61:E64)/(COUNTIF(E61:E64,\">0\"))))","v":""},{"$f":"IF(SUM(F61:F64)=0,\"\",(SUM(F61:F64)/(COUNTIF(F61:F64,\">0\"))))","v":""},{"$f":"IF(SUM(G61:G64)=0,\"\",(SUM(G61:G64)/(COUNTIF(G61:G64,\">0\"))))","v":""},"",{"$f":"IF(SUM(I61:I64)=0,\"\",(SUM(I61:I64)/(COUNTIF(I61:I64,\">0\"))))","v":""},{"$f":"IF(SUM(J61:J64)=0,\"\",(SUM(J61:J64)/(COUNTIF(J61:J64,\">0\"))))","v":""},{"$f":"IF(SUM(K61:K64)=0,\"\",SUM(K61:K64))","v":""},{"$f":"IF(SUM(L61:L64)=0,\"\",SUM(L61:L64))","v":""},{"$f":"IF(SUM(M61:M64)=0,\"\",SUM(M61:M64))","v":""},{"$f":"IF(SUM(N61:N64)=0,\"\",SUM(N61:N64))","v":""}]
[null,"OCT",{"$f":"IF(SUM(C66:C69)=0,\"\",(SUM(C66:C69)/(COUNTIF(C66:C69,\">0\"))))","v":""},{"$f":"IF(SUM(D66:D69)=0,\"\",(SUM(D66:D69)/(COUNTIF(D66:D69,\">0\"))))","v":""},{"$f":"IF(SUM(E66:E69)=0,\"\",(SUM(E66:E69)/(COUNTIF(E66:E69,\">0\"))))","v":""},{"$f":"IF(SUM(F66:F69)=0,\"\",(SUM(F66:F69)/(COUNTIF(F66:F69,\">0\"))))","v":""},{"$f":"IF(SUM(G66:G69)=0,\"\",(SUM(G66:G69)/(COUNTIF(G66:G69,\">0\"))))","v":""},"",{"$f":"IF(SUM(I66:I69)=0,\"\",(SUM(I66:I69)/(COUNTIF(I66:I69,\">0\"))))","v":""},{"$f":"IF(SUM(J66:J69)=0,\"\",(SUM(J66:J69)/(COUNTIF(J66:J69,\">0\"))))","v":""},{"$f":"IF(SUM(K66:K69)=0,\"\",SUM(K66:K69))","v":""},{"$f":"IF(SUM(L66:L69)=0,\"\",SUM(L66:L69))","v":""},{"$f":"IF(SUM(M66:M69)=0,\"\",SUM(M66:M69))","v":""},{"$f":"IF(SUM(N66:N69)=0,\"\",SUM(N66:N69))","v":""}]
[null,"NOV",{"$f":"IF(SUM(C70:C73)=0,\"\",(SUM(C70:C73)/(COUNTIF(C70:C73,\">0\"))))","v":""},{"$f":"IF(SUM(D70:D73)=0,\"\",(SUM(D70:D73)/(COUNTIF(D70:D73,\">0\"))))","v":""},{"$f":"IF(SUM(E70:E73)=0,\"\",(SUM(E70:E73)/(COUNTIF(E70:E73,\">0\"))))","v":""},{"$f":"IF(SUM(F70:F73)=0,\"\",(SUM(F70:F73)/(COUNTIF(F70:F73,\">0\"))))","v":""},{"$f":"IF(SUM(G70:G73)=0,\"\",(SUM(G70:G73)/(COUNTIF(G70:G73,\">0\"))))","v":""},"",{"$f":"IF(SUM(I70:I73)=0,\"\",(SUM(I70:I73)/(COUNTIF(I70:I73,\">0\"))))","v":""},{"$f":"IF(SUM(J70:J73)=0,\"\",(SUM(J70:J73)/(COUNTIF(J70:J73,\">0\"))))","v":""},{"$f":"IF(SUM(K70:K73)=0,\"\",SUM(K70:K73))","v":""},{"$f":"IF(SUM(L70:L73)=0,\"\",SUM(L70:L73))","v":""},{"$f":"IF(SUM(M70:M73)=0,\"\",SUM(M70:M73))","v":""},{"$f":"IF(SUM(N70:N73)=0,\"\",SUM(N70:N73))","v":""}]
[null,"DEC",{"$f":"IF(SUM(C74:C78)=0,\"\",(SUM(C74:C78)/(COUNTIF(C74:C78,\">0\"))))","v":""},{"$f":"IF(SUM(D74:D78)=0,\"\",(SUM(D74:D78)/(COUNTIF(D74:D78,\">0\"))))","v":""},{"$f":"IF(SUM(E74:E78)=0,\"\",(SUM(E74:E78)/(COUNTIF(E74:E78,\">0\"))))","v":""},{"$f":"IF(SUM(F74:F78)=0,\"\",(SUM(F74:F78)/(COUNTIF(F74:F78,\">0\"))))","v":""},{"$f":"IF(SUM(G74:G78)=0,\"\",(SUM(G74:G78)/(COUNTIF(G74:G78,\">0\"))))","v":""},"",{"$f":"IF(SUM(I74:I78)=0,\"\",(SUM(I74:I78)/(COUNTIF(I74:I78,\">0\"))))","v":""},{"$f":"IF(SUM(J74:J78)=0,\"\",(SUM(J74:J78)/(COUNTIF(J74:J78,\">0\"))))","v":""},{"$f":"IF(SUM(K74:K78)=0,\"\",SUM(K74:K78))","v":""},{"$f":"IF(SUM(L74:L78)=0,\"\",SUM(L74:L78))","v":""},{"$f":"IF(SUM(M74:M78)=0,\"\",SUM(M74:M78))","v":""},{"$f":"IF(SUM(N74:N78)=0,\"\",SUM(N74:N78))","v":""}]

{"sheet":"Monthly Avg","index":14,"n_rows":74,"n_cols":13,"rows_kept":74,"cut":false,"hidden":false,"merged":[[60,0,60,12],[4,0,4,12],[0,0,0,12],[1,4,1,9],[2,2,2,5],[6,0,9,0],[10,0,13,0],[14,0,17,0],[18,0,22,0],[23,0,26,0],[45,0,48,0],[49,0,52,0],[53,0,57,0],[27,0,30,0],[31,0,35,0],[36,0,39,0],[40,0,44,0]]}
["MONTHLY AVERAGES"]
[null,null,null,{"$f":"JAN!C1","v":"Monthly Report on"},{"$f":"JAN!D1","v":""},null,null,null,null,null,"Church"]
[null,"Pastor:",{"$f":"JAN!C3","v":""},null,null,null,null,null,null,null,"For Year",{"$f":"JAN!M3","v":2018}]
[]
["WEEKLY DATA"]
[{"$f":"JAN!A5","v":"Week"},{"$f":"JAN!B5","v":"Worship Attend"},{"$f":"JAN!C5","v":""},{"$f":"JAN!D5","v":""},{"$f":"JAN!E5","v":"Giving"},{"$f":"JAN!F5","v":""},{"$f":"JAN!G5","v":""},{"$f":"JAN!H5","v":"SG or Other"},{"$f":"JAN!I5","v":"Youth Group"},{"$f":"JAN!J5","v":"Conversions"},{"$f":"JAN!K5","v":"Baptisms"},{"$f":"JAN!L5","v":"Growth decisions"},{"$f":"JAN!M5","v":"Members Added"}]
["JAN",{"$f":"IF(JAN!B6=\"\",\"\",JAN!B6)","v":0},{"$f":"IF(JAN!C6=\"\",\"\",JAN!C6)","v":0},{"$f":"IF(JAN!D6=\"\",\"\",JAN!D6)","v":0},{"$f":"IF(JAN!E6=\"\",\"\",JAN!E6)","v":""},{"$f":"IF(JAN!F6=\"\",\"\",JAN!F6)","v":0},{"$f":"IF(JAN!G6=\"\",\"\",JAN!G6)","v":0},{"$f":"IF(JAN!H6=\"\",\"\",JAN!H6)","v":""},{"$f":"IF(JAN!I6=\"\",\"\",JAN!I6)","v":0},{"$f":"IF(JAN!J6=\"\",\"\",JAN!J6)","v":""},{"$f":"IF(JAN!K6=\"\",\"\",JAN!K6)","v":""},{"$f":"IF(JAN!L6=\"\",\"\",JAN!L6)","v":""},{"$f":"IF(JAN!M6=\"\",\"\",JAN!M6)","v":""}]
[null,{"$f":"IF(JAN!B7=\"\",\"\",JAN!B7)","v":0},{"$f":"IF(JAN!C7=\"\",\"\",JAN!C7)","v":0},{"$f":"IF(JAN!D7=\"\",\"\",JAN!D7)","v":0},{"$f":"IF(JAN!E7=\"\",\"\",JAN!E7)","v":""},{"$f":"IF(JAN!F7=\"\",\"\",JAN!F7)","v":0},{"$f":"IF(JAN!G7=\"\",\"\",JAN!G7)","v":0},{"$f":"IF(JAN!H7=\"\",\"\",JAN!H7)","v":""},{"$f":"IF(JAN!I7=\"\",\"\",JAN!I7)","v":0},{"$f":"IF(JAN!J7=\"\",\"\",JAN!J7)","v":""},{"$f":"IF(JAN!K7=\"\",\"\",JAN!K7)","v":""},{"$f":"IF(JAN!L7=\"\",\"\",JAN!L7)","v":""},{"$f":"IF(JAN!M7=\"\",\"\",JAN!M7)","v":""}]
[null,{"$f":"IF(JAN!B8=\"\",\"\",JAN!B8)","v":0},{"$f":"IF(JAN!C8=\"\",\"\",JAN!C8)","v":0},{"$f":"IF(JAN!D8=\"\",\"\",JAN!D8)","v":0},{"$f":"IF(JAN!E8=\"\",\"\",JAN!E8)","v":""},{"$f":"IF(JAN!F8=\"\",\"\",JAN!F8)","v":0},{"$f":"IF(JAN!G8=\"\",\"\",JAN!G8)","v":0},{"$f":"IF(JAN!H8=\"\",\"\",JAN!H8)","v":""},{"$f":"IF(JAN!I8=\"\",\"\",JAN!I8)","v":0},{"$f":"IF(JAN!J8=\"\",\"\",JAN!J8)","v":""},{"$f":"IF(JAN!K8=\"\",\"\",JAN!K8)","v":""},{"$f":"IF(JAN!L8=\"\",\"\",JAN!L8)","v":""},{"$f":"IF(JAN!M8=\"\",\"\",JAN!M8)","v":""}]
[null,{"$f":"IF(JAN!B9=\"\",\"\",JAN!B9)","v":0},{"$f":"IF(JAN!C9=\"\",\"\",JAN!C9)","v":0},{"$f":"IF(JAN!D9=\"\",\"\",JAN!D9)","v":0},{"$f":"IF(JAN!E9=\"\",\"\",JAN!E9)","v":""},{"$f":"IF(JAN!F9=\"\",\"\",JAN!F9)","v":0},{"$f":"IF(JAN!G9=\"\",\"\",JAN!G9)","v":0},{"$f":"IF(JAN!H9=\"\",\"\",JAN!H9)","v":""},{"$f":"IF(JAN!I9=\"\",\"\",JAN!I9)","v":0},{"$f":"IF(JAN!J9=\"\",\"\",JAN!J9)","v":""},{"$f":"IF(JAN!K9=\"\",\"\",JAN!K9)","v":""},{"$f":"IF(JAN!L9=\"\",\"\",JAN!L9)","v":""},{"$f":"IF(JAN!M9=\"\",\"\",JAN!M9)","v":""}]
["FEB",{"$f":"IF(FEB!B6=\"\",\"\",FEB!B6)","v":0},{"$f":"IF(FEB!C6=\"\",\"\",FEB!C6)","v":0},{"$f":"IF(FEB!D6=\"\",\"\",FEB!D6)","v":0},{"$f":"IF(FEB!E6=\"\",\"\",FEB!E6)","v":""},{"$f":"IF(FEB!F6=\"\",\"\",FEB!F6)","v":0},{"$f":"IF(FEB!G6=\"\",\"\",FEB!G6)","v":0},{"$f":"IF(FEB!H6=\"\",\"\",FEB!H6)","v":""},{"$f":"IF(FEB!I6=\"\",\"\",FEB!I6)","v":0},{"$f":"IF(FEB!J6=\"\",\"\",FEB!J6)","v":""},{"$f":"IF(FEB!K6=\"\",\"\",FEB!K6)","v":""},{"$f":"IF(FEB!L6=\"\",\"\",FEB!L6)","v":""},{"$f":"IF(FEB!M6=\"\",\"\",FEB!M6)","v":""}]
[7,{"$f":"IF(FEB!B7=\"\",\"\",FEB!B7)","v":0},{"$f":"IF(FEB!C7=\"\",\"\",FEB!C7)","v":0},{"$f":"IF(FEB!D7=\"\",\"\",FEB!D7)","v":0},{"$f":"IF(FEB!E7=\"\",\"\",FEB!E7)","v":""},{"$f":"IF(FEB!F7=\"\",\"\",FEB!F7)","v":0},{"$f":"IF(FEB!G7=\"\",\"\",FEB!G7)","v":0},{"$f":"IF(FEB!H7=\"\",\"\",FEB!H7)","v":""},{"$f":"IF(FEB!I7=\"\",\"\",FEB!I7)","v":0},{"$f":"IF(FEB!J7=\"\",\"\",FEB!J7)","v":""},{"$f":"IF(FEB!K7=\"\",\"\",FEB!K7)","v":""},{"$f":"IF(FEB!L7=\"\",\"\",FEB!L7)","v":""},{"$f":"IF(FEB!M7=\"\",\"\",FEB!M7)","v":""}]
[8,{"$f":"IF(FEB!B8=\"\",\"\",FEB!B8)","v":0},{"$f":"IF(FEB!C8=\"\",\"\",FEB!C8)","v":0},{"$f":"IF(FEB!D8=\"\",\"\",FEB!D8)","v":0},{"$f":"IF(FEB!E8=\"\",\"\",FEB!E8)","v":""},{"$f":"IF(FEB!F8=\"\",\"\",FEB!F8)","v":0},{"$f":"IF(FEB!G8=\"\",\"\",FEB!G8)","v":0},{"$f":"IF(FEB!H8=\"\",\"\",FEB!H8)","v":""},{"$f":"IF(FEB!I8=\"\",\"\",FEB!I8)","v":0},{"$f":"IF(FEB!J8=\"\",\"\",FEB!J8)","v":""},{"$f":"IF(FEB!K8=\"\",\"\",FEB!K8)","v":""},{"$f":"IF(FEB!L8=\"\",\"\",FEB!L8)","v":""},{"$f":"IF(FEB!M8=\"\",\"\",FEB!M8)","v":""}]
[9,{"$f":"IF(FEB!B9=\"\",\"\",FEB!B9)","v":0},{"$f":"IF(FEB!C9=\"\",\"\",FEB!C9)","v":0},{"$f":"IF(FEB!D9=\"\",\"\",FEB!D9)","v":0},{"$f":"IF(FEB!E9=\"\",\"\",FEB!E9)","v":""},{"$f":"IF(FEB!F9=\"\",\"\",FEB!F9)","v":0},{"$f":"IF(FEB!G9=\"\",\"\",FEB!G9)","v":0},{"$f":"IF(FEB!H9=\"\",\"\",FEB!H9)","v":""},{"$f":"IF(FEB!I9=\"\",\"\",FEB!I9)","v":0},{"$f":"IF(FEB!J9=\"\",\"\",FEB!J9)","v":""},{"$f":"IF(FEB!K9=\"\",\"\",FEB!K9)","v":""},{"$f":"IF(FEB!L9=\"\",\"\",FEB!L9)","v":""},{"$f":"IF(FEB!M9=\"\",\"\",FEB!M9)","v":""}]
["MAR",{"$f":"IF(MAR!B6=\"\",\"\",MAR!B6)","v":0},{"$f":"IF(MAR!C6=\"\",\"\",MAR!C6)","v":0},{"$f":"IF(MAR!D6=\"\",\"\",MAR!D6)","v":0},{"$f":"IF(MAR!E6=\"\",\"\",MAR!E6)","v":""},{"$f":"IF(MAR!F6=\"\",\"\",MAR!F6)","v":0},{"$f":"IF(MAR!G6=\"\",\"\",MAR!G6)","v":0},{"$f":"IF(MAR!H6=\"\",\"\",MAR!H6)","v":""},{"$f":"IF(MAR!I6=\"\",\"\",MAR!I6)","v":0},{"$f":"IF(MAR!J6=\"\",\"\",MAR!J6)","v":""},{"$f":"IF(MAR!K6=\"\",\"\",MAR!K6)","v":""},{"$f":"IF(MAR!L6=\"\",\"\",MAR!L6)","v":""},{"$f":"IF(MAR!M6=\"\",\"\",MAR!M6)","v":""}]
[11,{"$f":"IF(MAR!B7=\"\",\"\",MAR!B7)","v":0},{"$f":"IF(MAR!C7=\"\",\"\",MAR!C7)","v":0},{"$f":"IF(MAR!D7=\"\",\"\",MAR!D7)","v":0},{"$f":"IF(MAR!E7=\"\",\"\",MAR!E7)","v":""},{"$f":"IF(MAR!F7=\"\",\"\",MAR!F7)","v":0},{"$f":"IF(MAR!G7=\"\",\"\",MAR!G7)","v":0},{"$f":"IF(MAR!H7=\"\",\"\",MAR!H7)","v":""},{"$f":"IF(MAR!I7=\"\",\"\",MAR!I7)","v":0},{"$f":"IF(MAR!J7=\"\",\"\",MAR!J7)","v":""},{"$f":"IF(MAR!K7=\"\",\"\",MAR!K7)","v":""},{"$f":"IF(MAR!L7=\"\",\"\",MAR!L7)","v":""},{"$f":"IF(MAR!M7=\"\",\"\",MAR!M7)","v":""}]
[12,{"$f":"IF(MAR!B8=\"\",\"\",MAR!B8)","v":0},{"$f":"IF(MAR!C8=\"\",\"\",MAR!C8)","v":0},{"$f":"IF(MAR!D8=\"\",\"\",MAR!D8)","v":0},{"$f":"IF(MAR!E8=\"\",\"\",MAR!E8)","v":""},{"$f":"IF(MAR!F8=\"\",\"\",MAR!F8)","v":0},{"$f":"IF(MAR!G8=\"\",\"\",MAR!G8)","v":0},{"$f":"IF(MAR!H8=\"\",\"\",MAR!H8)","v":""},{"$f":"IF(MAR!I8=\"\",\"\",MAR!I8)","v":0},{"$f":"IF(MAR!J8=\"\",\"\",MAR!J8)","v":""},{"$f":"IF(MAR!K8=\"\",\"\",MAR!K8)","v":""},{"$f":"IF(MAR!L8=\"\",\"\",MAR!L8)","v":""},{"$f":"IF(MAR!M8=\"\",\"\",MAR!M8)","v":""}]
[13,{"$f":"IF(MAR!B9=\"\",\"\",MAR!B9)","v":0},{"$f":"IF(MAR!C9=\"\",\"\",MAR!C9)","v":0},{"$f":"IF(MAR!D9=\"\",\"\",MAR!D9)","v":0},{"$f":"IF(MAR!E9=\"\",\"\",MAR!E9)","v":""},{"$f":"IF(MAR!F9=\"\",\"\",MAR!F9)","v":0},{"$f":"IF(MAR!G9=\"\",\"\",MAR!G9)","v":0},{"$f":"IF(MAR!H9=\"\",\"\",MAR!H9)","v":""},{"$f":"IF(MAR!I9=\"\",\"\",MAR!I9)","v":0},{"$f":"IF(MAR!J9=\"\",\"\",MAR!J9)","v":""},{"$f":"IF(MAR!K9=\"\",\"\",MAR!K9)","v":""},{"$f":"IF(MAR!L9=\"\",\"\",MAR!L9)","v":""},{"$f":"IF(MAR!M9=\"\",\"\",MAR!M9)","v":""}]
["APR",{"$f":"IF(APR!B6=\"\",\"\",APR!B6)","v":0},{"$f":"IF(APR!C6=\"\",\"\",APR!C6)","v":0},{"$f":"IF(APR!D6=\"\",\"\",APR!D6)","v":0},{"$f":"IF(APR!E6=\"\",\"\",APR!E6)","v":""},{"$f":"IF(APR!F6=\"\",\"\",APR!F6)","v":0},{"$f":"IF(APR!G6=\"\",\"\",APR!G6)","v":0},{"$f":"IF(APR!H6=\"\",\"\",APR!H6)","v":""},{"$f":"IF(APR!I6=\"\",\"\",APR!I6)","v":0},{"$f":"IF(APR!J6=\"\",\"\",APR!J6)","v":""},{"$f":"IF(APR!K6=\"\",\"\",APR!K6)","v":""},{"$f":"IF(APR!L6=\"\",\"\",APR!L6)","v":""},{"$f":"IF(APR!M6=\"\",\"\",APR!M6)","v":""}]
[15,{"$f":"IF(APR!B7=\"\",\"\",APR!B7)","v":0},{"$f":"IF(APR!C7=\"\",\"\",APR!C7)","v":0},{"$f":"IF(APR!D7=\"\",\"\",APR!D7)","v":0},{"$f":"IF(APR!E7=\"\",\"\",APR!E7)","v":""},{"$f":"IF(APR!F7=\"\",\"\",APR!F7)","v":0},{"$f":"IF(APR!G7=\"\",\"\",APR!G7)","v":0},{"$f":"IF(APR!H7=\"\",\"\",APR!H7)","v":""},{"$f":"IF(APR!I7=\"\",\"\",APR!I7)","v":0},{"$f":"IF(APR!J7=\"\",\"\",APR!J7)","v":""},{"$f":"IF(APR!K7=\"\",\"\",APR!K7)","v":""},{"$f":"IF(APR!L7=\"\",\"\",APR!L7)","v":""},{"$f":"IF(APR!M7=\"\",\"\",APR!M7)","v":""}]
[16,{"$f":"IF(APR!B8=\"\",\"\",APR!B8)","v":0},{"$f":"IF(APR!C8=\"\",\"\",APR!C8)","v":0},{"$f":"IF(APR!D8=\"\",\"\",APR!D8)","v":0},{"$f":"IF(APR!E8=\"\",\"\",APR!E8)","v":""},{"$f":"IF(APR!F8=\"\",\"\",APR!F8)","v":0},{"$f":"IF(APR!G8=\"\",\"\",APR!G8)","v":0},{"$f":"IF(APR!H8=\"\",\"\",APR!H8)","v":""},{"$f":"IF(APR!I8=\"\",\"\",APR!I8)","v":0},{"$f":"IF(APR!J8=\"\",\"\",APR!J8)","v":""},{"$f":"IF(APR!K8=\"\",\"\",APR!K8)","v":""},{"$f":"IF(APR!L8=\"\",\"\",APR!L8)","v":""},{"$f":"IF(APR!M8=\"\",\"\",APR!M8)","v":""}]
[17,{"$f":"IF(APR!B9=\"\",\"\",APR!B9)","v":0},{"$f":"IF(APR!C9=\"\",\"\",APR!C9)","v":0},{"$f":"IF(APR!D9=\"\",\"\",APR!D9)","v":0},{"$f":"IF(APR!E9=\"\",\"\",APR!E9)","v":""},{"$f":"IF(APR!F9=\"\",\"\",APR!F9)","v":0},{"$f":"IF(APR!G9=\"\",\"\",APR!G9)","v":0},{"$f":"IF(APR!H9=\"\",\"\",APR!H9)","v":""},{"$f":"IF(APR!I9=\"\",\"\",APR!I9)","v":0},{"$f":"IF(APR!J9=\"\",\"\",APR!J9)","v":""},{"$f":"IF(APR!K9=\"\",\"\",APR!K9)","v":""},{"$f":"IF(APR!L9=\"\",\"\",APR!L9)","v":""},{"$f":"IF(APR!M9=\"\",\"\",APR!M9)","v":""}]
[18,{"$f":"IF(APR!B10=\"\",\"\",APR!B10)","v":0},{"$f":"IF(APR!C10=\"\",\"\",APR!C10)","v":0},{"$f":"IF(APR!D10=\"\",\"\",APR!D10)","v":0},{"$f":"IF(APR!E10=\"\",\"\",APR!E10)","v":""},{"$f":"IF(APR!F10=\"\",\"\",APR!F10)","v":0},{"$f":"IF(APR!G10=\"\",\"\",APR!G10)","v":0},{"$f":"IF(APR!H10=\"\",\"\",APR!H10)","v":""},{"$f":"IF(APR!I10=\"\",\"\",APR!I10)","v":0},{"$f":"IF(APR!J10=\"\",\"\",APR!J10)","v":""},{"$f":"IF(APR!K10=\"\",\"\",APR!K10)","v":""},{"$f":"IF(APR!L10=\"\",\"\",APR!L10)","v":""},{"$f":"IF(APR!M10=\"\",\"\",APR!M10)","v":""}]
["MAY",{"$f":"IF(MAY!B6=\"\",\"\",MAY!B6)","v":0},{"$f":"IF(MAY!C6=\"\",\"\",MAY!C6)","v":0},{"$f":"IF(MAY!D6=\"\",\"\",MAY!D6)","v":0},{"$f":"IF(MAY!E6=\"\",\"\",MAY!E6)","v":""},{"$f":"IF(MAY!F6=\"\",\"\",MAY!F6)","v":0},{"$f":"IF(MAY!G6=\"\",\"\",MAY!G6)","v":0},{"$f":"IF(MAY!H6=\"\",\"\",MAY!H6)","v":""},{"$f":"IF(MAY!I6=\"\",\"\",MAY!I6)","v":0},{"$f":"IF(MAY!J6=\"\",\"\",MAY!J6)","v":""},{"$f":"IF(MAY!K6=\"\",\"\",MAY!K6)","v":""},{"$f":"IF(MAY!L6=\"\",\"\",MAY!L6)","v":""},{"$f":"IF(MAY!M6=\"\",\"\",MAY!M6)","v":""}]
[20,{"$f":"IF(MAY!B7=\"\",\"\",MAY!B7)","v":0},{"$f":"IF(MAY!C7=\"\",\"\",MAY!C7)","v":0},{"$f":"IF(MAY!D7=\"\",\"\",MAY!D7)","v":0},{"$f":"IF(MAY!E7=\"\",\"\",MAY!E7)","v":""},{"$f":"IF(MAY!F7=\"\",\"\",MAY!F7)","v":0},{"$f":"IF(MAY!G7=\"\",\"\",MAY!G7)","v":0},{"$f":"IF(MAY!H7=\"\",\"\",MAY!H7)","v":""},{"$f":"IF(MAY!I7=\"\",\"\",MAY!I7)","v":0},{"$f":"IF(MAY!J7=\"\",\"\",MAY!J7)","v":""},{"$f":"IF(MAY!K7=\"\",\"\",MAY!K7)","v":""},{"$f":"IF(MAY!L7=\"\",\"\",MAY!L7)","v":""},{"$f":"IF(MAY!M7=\"\",\"\",MAY!M7)","v":""}]
[21,{"$f":"IF(MAY!B8=\"\",\"\",MAY!B8)","v":0},{"$f":"IF(MAY!C8=\"\",\"\",MAY!C8)","v":0},{"$f":"IF(MAY!D8=\"\",\"\",MAY!D8)","v":0},{"$f":"IF(MAY!E8=\"\",\"\",MAY!E8)","v":""},{"$f":"IF(MAY!F8=\"\",\"\",MAY!F8)","v":0},{"$f":"IF(MAY!G8=\"\",\"\",MAY!G8)","v":0},{"$f":"IF(MAY!H8=\"\",\"\",MAY!H8)","v":""},{"$f":"IF(MAY!I8=\"\",\"\",MAY!I8)","v":0},{"$f":"IF(MAY!J8=\"\",\"\",MAY!J8)","v":""},{"$f":"IF(MAY!K8=\"\",\"\",MAY!K8)","v":""},{"$f":"IF(MAY!L8=\"\",\"\",MAY!L8)","v":""},{"$f":"IF(MAY!M8=\"\",\"\",MAY!M8)","v":""}]
[22,{"$f":"IF(MAY!B9=\"\",\"\",MAY!B9)","v":0},{"$f":"IF(MAY!C9=\"\",\"\",MAY!C9)","v":0},{"$f":"IF(MAY!D9=\"\",\"\",MAY!D9)","v":0},{"$f":"IF(MAY!E9=\"\",\"\",MAY!E9)","v":""},{"$f":"IF(MAY!F9=\"\",\"\",MAY!F9)","v":0},{"$f":"IF(MAY!G9=\"\",\"\",MAY!G9)","v":0},{"$f":"IF(MAY!H9=\"\",\"\",MAY!H9)","v":""},{"$f":"IF(MAY!I9=\"\",\"\",MAY!I9)","v":0},{"$f":"IF(MAY!J9=\"\",\"\",MAY!J9)","v":""},{"$f":"IF(MAY!K9=\"\",\"\",MAY!K9)","v":""},{"$f":"IF(MAY!L9=\"\",\"\",MAY!L9)","v":""},{"$f":"IF(MAY!M9=\"\",\"\",MAY!M9)","v":""}]
["JUNE",{"$f":"IF(JUNE!B6=\"\",\"\",JUNE!B6)","v":0},{"$f":"IF(JUNE!C6=\"\",\"\",JUNE!C6)","v":0},{"$f":"IF(JUNE!D6=\"\",\"\",JUNE!D6)","v":0},{"$f":"IF(JUNE!E6=\"\",\"\",JUNE!E6)","v":""},{"$f":"IF(JUNE!F6=\"\",\"\",JUNE!F6)","v":0},{"$f":"IF(JUNE!G6=\"\",\"\",JUNE!G6)","v":0},{"$f":"IF(JUNE!H6=\"\",\"\",JUNE!H6)","v":""},{"$f":"IF(JUNE!I6=\"\",\"\",JUNE!I6)","v":0},{"$f":"IF(JUNE!J6=\"\",\"\",JUNE!J6)","v":""},{"$f":"IF(JUNE!K6=\"\",\"\",JUNE!K6)","v":""},{"$f":"IF(JUNE!L6=\"\",\"\",JUNE!L6)","v":""},{"$f":"IF(JUNE!M6=\"\",\"\",JUNE!M6)","v":""}]
[24,{"$f":"IF(JUNE!B7=\"\",\"\",JUNE!B7)","v":0},{"$f":"IF(JUNE!C7=\"\",\"\",JUNE!C7)","v":0},{"$f":"IF(JUNE!D7=\"\",\"\",JUNE!D7)","v":0},{"$f":"IF(JUNE!E7=\"\",\"\",JUNE!E7)","v":""},{"$f":"IF(JUNE!F7=\"\",\"\",JUNE!F7)","v":0},{"$f":"IF(JUNE!G7=\"\",\"\",JUNE!G7)","v":0},{"$f":"IF(JUNE!H7=\"\",\"\",JUNE!H7)","v":""},{"$f":"IF(JUNE!I7=\"\",\"\",JUNE!I7)","v":0},{"$f":"IF(JUNE!J7=\"\",\"\",JUNE!J7)","v":""},{"$f":"IF(JUNE!K7=\"\",\"\",JUNE!K7)","v":""},{"$f":"IF(JUNE!L7=\"\",\"\",JUNE!L7)","v":""},{"$f":"IF(JUNE!M7=\"\",\"\",JUNE!M7)","v":""}]
[25,{"$f":"IF(JUNE!B8=\"\",\"\",JUNE!B8)","v":0},{"$f":"IF(JUNE!C8=\"\",\"\",JUNE!C8)","v":0},{"$f":"IF(JUNE!D8=\"\",\"\",JUNE!D8)","v":0},{"$f":"IF(JUNE!E8=\"\",\"\",JUNE!E8)","v":""},{"$f":"IF(JUNE!F8=\"\",\"\",JUNE!F8)","v":0},{"$f":"IF(JUNE!G8=\"\",\"\",JUNE!G8)","v":0},{"$f":"IF(JUNE!H8=\"\",\"\",JUNE!H8)","v":""},{"$f":"IF(JUNE!I8=\"\",\"\",JUNE!I8)","v":0},{"$f":"IF(JUNE!J8=\"\",\"\",JUNE!J8)","v":""},{"$f":"IF(JUNE!K8=\"\",\"\",JUNE!K8)","v":""},{"$f":"IF(JUNE!L8=\"\",\"\",JUNE!L8)","v":""},{"$f":"IF(JUNE!M8=\"\",\"\",JUNE!M8)","v":""}]
[26,{"$f":"IF(JUNE!B9=\"\",\"\",JUNE!B9)","v":0},{"$f":"IF(JUNE!C9=\"\",\"\",JUNE!C9)","v":0},{"$f":"IF(JUNE!D9=\"\",\"\",JUNE!D9)","v":0},{"$f":"IF(JUNE!E9=\"\",\"\",JUNE!E9)","v":""},{"$f":"IF(JUNE!F9=\"\",\"\",JUNE!F9)","v":0},{"$f":"IF(JUNE!G9=\"\",\"\",JUNE!G9)","v":0},{"$f":"IF(JUNE!H9=\"\",\"\",JUNE!H9)","v":""},{"$f":"IF(JUNE!I9=\"\",\"\",JUNE!I9)","v":0},{"$f":"IF(JUNE!J9=\"\",\"\",JUNE!J9)","v":""},{"$f":"IF(JUNE!K9=\"\",\"\",JUNE!K9)","v":""},{"$f":"IF(JUNE!L9=\"\",\"\",JUNE!L9)","v":""},{"$f":"IF(JUNE!M9=\"\",\"\",JUNE!M9)","v":""}]
["JULY",{"$f":"IF(JULY!B6=\"\",\"\",JULY!B6)","v":0},{"$f":"IF(JULY!C6=\"\",\"\",JULY!C6)","v":0},{"$f":"IF(JULY!D6=\"\",\"\",JULY!D6)","v":0},{"$f":"IF(JULY!E6=\"\",\"\",JULY!E6)","v":""},{"$f":"IF(JULY!F6=\"\",\"\",JULY!F6)","v":0},{"$f":"IF(JULY!G6=\"\",\"\",JULY!G6)","v":0},{"$f":"IF(JULY!H6=\"\",\"\",JULY!H6)","v":""},{"$f":"IF(JULY!I6=\"\",\"\",JULY!I6)","v":0},{"$f":"IF(JULY!J6=\"\",\"\",JULY!J6)","v":""},{"$f":"IF(JULY!K6=\"\",\"\",JULY!K6)","v":""},{"$f":"IF(JULY!L6=\"\",\"\",JULY!L6)","v":""},{"$f":"IF(JULY!M6=\"\",\"\",JULY!M6)","v":""}]
[28,{"$f":"IF(JULY!B7=\"\",\"\",JULY!B7)","v":0},{"$f":"IF(JULY!C7=\"\",\"\",JULY!C7)","v":0},{"$f":"IF(JULY!D7=\"\",\"\",JULY!D7)","v":0},{"$f":"IF(JULY!E7=\"\",\"\",JULY!E7)","v":""},{"$f":"IF(JULY!F7=\"\",\"\",JULY!F7)","v":0},{"$f":"IF(JULY!G7=\"\",\"\",JULY!G7)","v":0},{"$f":"IF(JULY!H7=\"\",\"\",JULY!H7)","v":""},{"$f":"IF(JULY!I7=\"\",\"\",JULY!I7)","v":0},{"$f":"IF(JULY!J7=\"\",\"\",JULY!J7)","v":""},{"$f":"IF(JULY!K7=\"\",\"\",JULY!K7)","v":""},{"$f":"IF(JULY!L7=\"\",\"\",JULY!L7)","v":""},{"$f":"IF(JULY!M7=\"\",\"\",JULY!M7)","v":""}]
[29,{"$f":"IF(JULY!B8=\"\",\"\",JULY!B8)","v":0},{"$f":"IF(JULY!C8=\"\",\"\",JULY!C8)","v":0},{"$f":"IF(JULY!D8=\"\",\"\",JULY!D8)","v":0},{"$f":"IF(JULY!E8=\"\",\"\",JULY!E8)","v":""},{"$f":"IF(JULY!F8=\"\",\"\",JULY!F8)","v":0},{"$f":"IF(JULY!G8=\"\",\"\",JULY!G8)","v":0},{"$f":"IF(JULY!H8=\"\",\"\",JULY!H8)","v":""},{"$f":"IF(JULY!I8=\"\",\"\",JULY!I8)","v":0},{"$f":"IF(JULY!J8=\"\",\"\",JULY!J8)","v":""},{"$f":"IF(JULY!K8=\"\",\"\",JULY!K8)","v":""},{"$f":"IF(JULY!L8=\"\",\"\",JULY!L8)","v":""},{"$f":"IF(JULY!M8=\"\",\"\",JULY!M8)","v":""}]
[30,{"$f":"IF(JULY!B9=\"\",\"\",JULY!B9)","v":0},{"$f":"IF(JULY!C9=\"\",\"\",JULY!C9)","v":0},{"$f":"IF(JULY!D9=\"\",\"\",JULY!D9)","v":0},{"$f":"IF(JULY!E9=\"\",\"\",JULY!E9)","v":""},{"$f":"IF(JULY!F9=\"\",\"\",JULY!F9)","v":0},{"$f":"IF(JULY!G9=\"\",\"\",JULY!G9)","v":0},{"$f":"IF(JULY!H9=\"\",\"\",JULY!H9)","v":""},{"$f":"IF(JULY!I9=\"\",\"\",JULY!I9)","v":0},{"$f":"IF(JULY!J9=\"\",\"\",JULY!J9)","v":""},{"$f":"IF(JULY!K9=\"\",\"\",JULY!K9)","v":""},{"$f":"IF(JULY!L9=\"\",\"\",JULY!L9)","v":""},{"$f":"IF(JULY!M9=\"\",\"\",JULY!M9)","v":""}]
[31,{"$f":"IF(JULY!B10=\"\",\"\",JULY!B10)","v":0},{"$f":"IF(JULY!C10=\"\",\"\",JULY!C10)","v":0},{"$f":"IF(JULY!D10=\"\",\"\",JULY!D10)","v":0},{"$f":"IF(JULY!E10=\"\",\"\",JULY!E10)","v":""},{"$f":"IF(JULY!F10=\"\",\"\",JULY!F10)","v":0},{"$f":"IF(JULY!G10=\"\",\"\",JULY!G10)","v":0},{"$f":"IF(JULY!H10=\"\",\"\",JULY!H10)","v":""},{"$f":"IF(JULY!I10=\"\",\"\",JULY!I10)","v":0},{"$f":"IF(JULY!J10=\"\",\"\",JULY!J10)","v":""},{"$f":"IF(JULY!K10=\"\",\"\",JULY!K10)","v":""},{"$f":"IF(JULY!L10=\"\",\"\",JULY!L10)","v":""},{"$f":"IF(JULY!M10=\"\",\"\",JULY!M10)","v":""}]
["AUG",{"$f":"IF(AUG!B6=\"\",\"\",AUG!B6)","v":0},{"$f":"IF(AUG!C6=\"\",\"\",AUG!C6)","v":0},{"$f":"IF(AUG!D6=\"\",\"\",AUG!D6)","v":0},{"$f":"IF(AUG!E6=\"\",\"\",AUG!E6)","v":""},{"$f":"IF(AUG!F6=\"\",\"\",AUG!F6)","v":0},{"$f":"IF(AUG!G6=\"\",\"\",AUG!G6)","v":0},{"$f":"IF(AUG!H6=\"\",\"\",AUG!H6)","v":""},{"$f":"IF(AUG!I6=\"\",\"\",AUG!I6)","v":0},{"$f":"IF(AUG!J6=\"\",\"\",AUG!J6)","v":""},{"$f":"IF(AUG!K6=\"\",\"\",AUG!K6)","v":""},{"$f":"IF(AUG!L6=\"\",\"\",AUG!L6)","v":""},{"$f":"IF(AUG!M6=\"\",\"\",AUG!M6)","v":""}]
[33,{"$f":"IF(AUG!B7=\"\",\"\",AUG!B7)","v":0},{"$f":"IF(AUG!C7=\"\",\"\",AUG!C7)","v":0},{"$f":"IF(AUG!D7=\"\",\"\",AUG!D7)","v":0},{"$f":"IF(AUG!E7=\"\",\"\",AUG!E7)","v":""},{"$f":"IF(AUG!F7=\"\",\"\",AUG!F7)","v":0},{"$f":"IF(AUG!G7=\"\",\"\",AUG!G7)","v":0},{"$f":"IF(AUG!H7=\"\",\"\",AUG!H7)","v":""},{"$f":"IF(AUG!I7=\"\",\"\",AUG!I7)","v":0},{"$f":"IF(AUG!J7=\"\",\"\",AUG!J7)","v":""},{"$f":"IF(AUG!K7=\"\",\"\",AUG!K7)","v":""},{"$f":"IF(AUG!L7=\"\",\"\",AUG!L7)","v":""},{"$f":"IF(AUG!M7=\"\",\"\",AUG!M7)","v":""}]
[34,{"$f":"IF(AUG!B8=\"\",\"\",AUG!B8)","v":0},{"$f":"IF(AUG!C8=\"\",\"\",AUG!C8)","v":0},{"$f":"IF(AUG!D8=\"\",\"\",AUG!D8)","v":0},{"$f":"IF(AUG!E8=\"\",\"\",AUG!E8)","v":""},{"$f":"IF(AUG!F8=\"\",\"\",AUG!F8)","v":0},{"$f":"IF(AUG!G8=\"\",\"\",AUG!G8)","v":0},{"$f":"IF(AUG!H8=\"\",\"\",AUG!H8)","v":""},{"$f":"IF(AUG!I8=\"\",\"\",AUG!I8)","v":0},{"$f":"IF(AUG!J8=\"\",\"\",AUG!J8)","v":""},{"$f":"IF(AUG!K8=\"\",\"\",AUG!K8)","v":""},{"$f":"IF(AUG!L8=\"\",\"\",AUG!L8)","v":""},{"$f":"IF(AUG!M8=\"\",\"\",AUG!M8)","v":""}]
[35,{"$f":"IF(AUG!B9=\"\",\"\",AUG!B9)","v":0},{"$f":"IF(AUG!C9=\"\",\"\",AUG!C9)","v":0},{"$f":"IF(AUG!D9=\"\",\"\",AUG!D9)","v":0},{"$f":"IF(AUG!E9=\"\",\"\",AUG!E9)","v":""},{"$f":"IF(AUG!F9=\"\",\"\",AUG!F9)","v":0},{"$f":"IF(AUG!G9=\"\",\"\",AUG!G9)","v":0},{"$f":"IF(AUG!H9=\"\",\"\",AUG!H9)","v":""},{"$f":"IF(AUG!I9=\"\",\"\",AUG!I9)","v":0},{"$f":"IF(AUG!J9=\"\",\"\",AUG!J9)","v":""},{"$f":"IF(AUG!K9=\"\",\"\",AUG!K9)","v":""},{"$f":"IF(AUG!L9=\"\",\"\",AUG!L9)","v":""},{"$f":"IF(AUG!M9=\"\",\"\",AUG!M9)","v":""}]
["SEPT",{"$f":"IF(SEPT!B6=\"\",\"\",SEPT!B6)","v":0},{"$f":"IF(SEPT!C6=\"\",\"\",SEPT!C6)","v":0},{"$f":"IF(SEPT!D6=\"\",\"\",SEPT!D6)","v":0},{"$f":"IF(SEPT!E6=\"\",\"\",SEPT!E6)","v":""},{"$f":"IF(SEPT!F6=\"\",\"\",SEPT!F6)","v":0},{"$f":"IF(SEPT!G6=\"\",\"\",SEPT!G6)","v":0},{"$f":"IF(SEPT!H6=\"\",\"\",SEPT!H6)","v":""},{"$f":"IF(SEPT!I6=\"\",\"\",SEPT!I6)","v":0},{"$f":"IF(SEPT!J6=\"\",\"\",SEPT!J6)","v":""},{"$f":"IF(SEPT!K6=\"\",\"\",SEPT!K6)","v":""},{"$f":"IF(SEPT!L6=\"\",\"\",SEPT!L6)","v":""},{"$f":"IF(SEPT!M6=\"\",\"\",SEPT!M6)","v":""}]
[37,{"$f":"IF(SEPT!B7=\"\",\"\",SEPT!B7)","v":0},{"$f":"IF(SEPT!C7=\"\",\"\",SEPT!C7)","v":0},{"$f":"IF(SEPT!D7=\"\",\"\",SEPT!D7)","v":0},{"$f":"IF(SEPT!E7=\"\",\"\",SEPT!E7)","v":""},{"$f":"IF(SEPT!F7=\"\",\"\",SEPT!F7)","v":0},{"$f":"IF(SEPT!G7=\"\",\"\",SEPT!G7)","v":0},{"$f":"IF(SEPT!H7=\"\",\"\",SEPT!H7)","v":""},{"$f":"IF(SEPT!I7=\"\",\"\",SEPT!I7)","v":0},{"$f":"IF(SEPT!J7=\"\",\"\",SEPT!J7)","v":""},{"$f":"IF(SEPT!K7=\"\",\"\",SEPT!K7)","v":""},{"$f":"IF(SEPT!L7=\"\",\"\",SEPT!L7)","v":""},{"$f":"IF(SEPT!M7=\"\",\"\",SEPT!M7)","v":""}]
[38,{"$f":"IF(SEPT!B8=\"\",\"\",SEPT!B8)","v":0},{"$f":"IF(SEPT!C8=\"\",\"\",SEPT!C8)","v":0},{"$f":"IF(SEPT!D8=\"\",\"\",SEPT!D8)","v":0},{"$f":"IF(SEPT!E8=\"\",\"\",SEPT!E8)","v":""},{"$f":"IF(SEPT!F8=\"\",\"\",SEPT!F8)","v":0},{"$f":"IF(SEPT!G8=\"\",\"\",SEPT!G8)","v":0},{"$f":"IF(SEPT!H8=\"\",\"\",SEPT!H8)","v":""},{"$f":"IF(SEPT!I8=\"\",\"\",SEPT!I8)","v":0},{"$f":"IF(SEPT!J8=\"\",\"\",SEPT!J8)","v":""},{"$f":"IF(SEPT!K8=\"\",\"\",SEPT!K8)","v":""},{"$f":"IF(SEPT!L8=\"\",\"\",SEPT!L8)","v":""},{"$f":"IF(SEPT!M8=\"\",\"\",SEPT!M8)","v":""}]
[39,{"$f":"IF(SEPT!B9=\"\",\"\",SEPT!B9)","v":0},{"$f":"IF(SEPT!C9=\"\",\"\",SEPT!C9)","v":0},{"$f":"IF(SEPT!D9=\"\",\"\",SEPT!D9)","v":0},{"$f":"IF(SEPT!E9=\"\",\"\",SEPT!E9)","v":""},{"$f":"IF(SEPT!F9=\"\",\"\",SEPT!F9)","v":0},{"$f":"IF(SEPT!G9=\"\",\"\",SEPT!G9)","v":0},{"$f":"IF(SEPT!H9=\"\",\"\",SEPT!H9)","v":""},{"$f":"IF(SEPT!I9=\"\",\"\",SEPT!I9)","v":0},{"$f":"IF(SEPT!J9=\"\",\"\",SEPT!J9)","v":""},{"$f":"IF(SEPT!K9=\"\",\"\",SEPT!K9)","v":""},{"$f":"IF(SEPT!L9=\"\",\"\",SEPT!L9)","v":""},{"$f":"IF(SEPT!M9=\"\",\"\",SEPT!M9)","v":""}]
[null,{"$f":"IF(SEPT!B10=\"\",\"\",SEPT!B10)","v":0},{"$f":"IF(SEPT!C10=\"\",\"\",SEPT!C10)","v":0},{"$f":"IF(SEPT!D10=\"\",\"\",SEPT!D10)","v":0},{"$f":"IF(SEPT!E10=\"\",\"\",SEPT!E10)","v":""},{"$f":"IF(SEPT!F10=\"\",\"\",SEPT!F10)","v":0},{"$f":"IF(SEPT!G10=\"\",\"\",SEPT!G10)","v":0},{"$f":"IF(SEPT!H10=\"\",\"\",SEPT!H10)","v":""},{"$f":"IF(SEPT!I10=\"\",\"\",SEPT!I10)","v":0},{"$f":"IF(SEPT!J10=\"\",\"\",SEPT!J10)","v":""},{"$f":"IF(SEPT!K10=\"\",\"\",SEPT!K10)","v":""},{"$f":"IF(SEPT!L10=\"\",\"\",SEPT!L10)","v":""},{"$f":"IF(SEPT!M10=\"\",\"\",SEPT!M10)","v":""}]
["OCT",{"$f":"IF(OCT!B6=\"\",\"\",OCT!B6)","v":0},{"$f":"IF(OCT!C6=\"\",\"\",OCT!C6)","v":0},{"$f":"IF(OCT!D6=\"\",\"\",OCT!D6)","v":0},{"$f":"IF(OCT!E6=\"\",\"\",OCT!E6)","v":""},{"$f":"IF(OCT!F6=\"\",\"\",OCT!F6)","v":0},{"$f":"IF(OCT!G6=\"\",\"\",OCT!G6)","v":0},{"$f":"IF(OCT!H6=\"\",\"\",OCT!H6)","v":""},{"$f":"IF(OCT!I6=\"\",\"\",OCT!I6)","v":0},{"$f":"IF(OCT!J6=\"\",\"\",OCT!J6)","v":""},{"$f":"IF(OCT!K6=\"\",\"\",OCT!K6)","v":""},{"$f":"IF(OCT!L6=\"\",\"\",OCT!L6)","v":""},{"$f":"IF(OCT!M6=\"\",\"\",OCT!M6)","v":""}]
[41,{"$f":"IF(OCT!B7=\"\",\"\",OCT!B7)","v":0},{"$f":"IF(OCT!C7=\"\",\"\",OCT!C7)","v":0},{"$f":"IF(OCT!D7=\"\",\"\",OCT!D7)","v":0},{"$f":"IF(OCT!E7=\"\",\"\",OCT!E7)","v":""},{"$f":"IF(OCT!F7=\"\",\"\",OCT!F7)","v":0},{"$f":"IF(OCT!G7=\"\",\"\",OCT!G7)","v":0},{"$f":"IF(OCT!H7=\"\",\"\",OCT!H7)","v":""},{"$f":"IF(OCT!I7=\"\",\"\",OCT!I7)","v":0},{"$f":"IF(OCT!J7=\"\",\"\",OCT!J7)","v":""},{"$f":"IF(OCT!K7=\"\",\"\",OCT!K7)","v":""},{"$f":"IF(OCT!L7=\"\",\"\",OCT!L7)","v":""},{"$f":"IF(OCT!M7=\"\",\"\",OCT!M7)","v":""}]
[42,{"$f":"IF(OCT!B8=\"\",\"\",OCT!B8)","v":0},{"$f":"IF(OCT!C8=\"\",\"\",OCT!C8)","v":0},{"$f":"IF(OCT!D8=\"\",\"\",OCT!D8)","v":0},{"$f":"IF(OCT!E8=\"\",\"\",OCT!E8)","v":""},{"$f":"IF(OCT!F8=\"\",\"\",OCT!F8)","v":0},{"$f":"IF(OCT!G8=\"\",\"\",OCT!G8)","v":0},{"$f":"IF(OCT!H8=\"\",\"\",OCT!H8)","v":""},{"$f":"IF(OCT!I8=\"\",\"\",OCT!I8)","v":0},{"$f":"IF(OCT!J8=\"\",\"\",OCT!J8)","v":""},{"$f":"IF(OCT!K8=\"\",\"\",OCT!K8)","v":""},{"$f":"IF(OCT!L8=\"\",\"\",OCT!L8)","v":""},{"$f":"IF(OCT!M8=\"\",\"\",OCT!M8)","v":""}]
[43,{"$f":"IF(OCT!B9=\"\",\"\",OCT!B9)","v":0},{"$f":"IF(OCT!C9=\"\",\"\",OCT!C9)","v":0},{"$f":"IF(OCT!D9=\"\",\"\",OCT!D9)","v":0},{"$f":"IF(OCT!E9=\"\",\"\",OCT!E9)","v":""},{"$f":"IF(OCT!F9=\"\",\"\",OCT!F9)","v":0},{"$f":"IF(OCT!G9=\"\",\"\",OCT!G9)","v":0},{"$f":"IF(OCT!H9=\"\",\"\",OCT!H9)","v":""},{"$f":"IF(OCT!I9=\"\",\"\",OCT!I9)","v":0},{"$f":"IF(OCT!J9=\"\",\"\",OCT!J9)","v":""},{"$f":"IF(OCT!K9=\"\",\"\",OCT!K9)","v":""},{"$f":"IF(OCT!L9=\"\",\"\",OCT!L9)","v":""},{"$f":"IF(OCT!M9=\"\",\"\",OCT!M9)","v":""}]
["NOV",{"$f":"IF(NOV!B6=\"\",\"\",NOV!B6)","v":0},{"$f":"IF(NOV!C6=\"\",\"\",NOV!C6)","v":0},{"$f":"IF(NOV!D6=\"\",\"\",NOV!D6)","v":0},{"$f":"IF(NOV!E6=\"\",\"\",NOV!E6)","v":""},{"$f":"IF(NOV!F6=\"\",\"\",NOV!F6)","v":0},{"$f":"IF(NOV!G6=\"\",\"\",NOV!G6)","v":0},{"$f":"IF(NOV!H6=\"\",\"\",NOV!H6)","v":""},{"$f":"IF(NOV!I6=\"\",\"\",NOV!I6)","v":0},{"$f":"IF(NOV!J6=\"\",\"\",NOV!J6)","v":""},{"$f":"IF(NOV!K6=\"\",\"\",NOV!K6)","v":""},{"$f":"IF(NOV!L6=\"\",\"\",NOV!L6)","v":""},{"$f":"IF(NOV!M6=\"\",\"\",NOV!M6)","v":""}]
[46,{"$f":"IF(NOV!B7=\"\",\"\",NOV!B7)","v":0},{"$f":"IF(NOV!C7=\"\",\"\",NOV!C7)","v":0},{"$f":"IF(NOV!D7=\"\",\"\",NOV!D7)","v":0},{"$f":"IF(NOV!E7=\"\",\"\",NOV!E7)","v":""},{"$f":"IF(NOV!F7=\"\",\"\",NOV!F7)","v":0},{"$f":"IF(NOV!G7=\"\",\"\",NOV!G7)","v":0},{"$f":"IF(NOV!H7=\"\",\"\",NOV!H7)","v":""},{"$f":"IF(NOV!I7=\"\",\"\",NOV!I7)","v":0},{"$f":"IF(NOV!J7=\"\",\"\",NOV!J7)","v":""},{"$f":"IF(NOV!K7=\"\",\"\",NOV!K7)","v":""},{"$f":"IF(NOV!L7=\"\",\"\",NOV!L7)","v":""},{"$f":"IF(NOV!M7=\"\",\"\",NOV!M7)","v":""}]
[47,{"$f":"IF(NOV!B8=\"\",\"\",NOV!B8)","v":0},{"$f":"IF(NOV!C8=\"\",\"\",NOV!C8)","v":0},{"$f":"IF(NOV!D8=\"\",\"\",NOV!D8)","v":0},{"$f":"IF(NOV!E8=\"\",\"\",NOV!E8)","v":""},{"$f":"IF(NOV!F8=\"\",\"\",NOV!F8)","v":0},{"$f":"IF(NOV!G8=\"\",\"\",NOV!G8)","v":0},{"$f":"IF(NOV!H8=\"\",\"\",NOV!H8)","v":""},{"$f":"IF(NOV!I8=\"\",\"\",NOV!I8)","v":0},{"$f":"IF(NOV!J8=\"\",\"\",NOV!J8)","v":""},{"$f":"IF(NOV!K8=\"\",\"\",NOV!K8)","v":""},{"$f":"IF(NOV!L8=\"\",\"\",NOV!L8)","v":""},{"$f":"IF(NOV!M8=\"\",\"\",NOV!M8)","v":""}]
[48,{"$f":"IF(NOV!B9=\"\",\"\",NOV!B9)","v":0},{"$f":"IF(NOV!C9=\"\",\"\",NOV!C9)","v":0},{"$f":"IF(NOV!D9=\"\",\"\",NOV!D9)","v":0},{"$f":"IF(NOV!E9=\"\",\"\",NOV!E9)","v":""},{"$f":"IF(NOV!F9=\"\",\"\",NOV!F9)","v":0},{"$f":"IF(NOV!G9=\"\",\"\",NOV!G9)","v":0},{"$f":"IF(NOV!H9=\"\",\"\",NOV!H9)","v":""},{"$f":"IF(NOV!I9=\"\",\"\",NOV!I9)","v":0},{"$f":"IF(NOV!J9=\"\",\"\",NOV!J9)","v":""},{"$f":"IF(NOV!K9=\"\",\"\",NOV!K9)","v":""},{"$f":"IF(NOV!L9=\"\",\"\",NOV!L9)","v":""},{"$f":"IF(NOV!M9=\"\",\"\",NOV!M9)","v":""}]
["DEC",{"$f":"IF(DEC!B6=\"\",\"\",DEC!B6)","v":0},{"$f":"IF(DEC!C6=\"\",\"\",DEC!C6)","v":0},{"$f":"IF(DEC!D6=\"\",\"\",DEC!D6)","v":0},{"$f":"IF(DEC!E6=\"\",\"\",DEC!E6)","v":""},{"$f":"IF(DEC!F6=\"\",\"\",DEC!F6)","v":0},{"$f":"IF(DEC!G6=\"\",\"\",DEC!G6)","v":0},{"$f":"IF(DEC!H6=\"\",\"\",DEC!H6)","v":""},{"$f":"IF(DEC!I6=\"\",\"\",DEC!I6)","v":0},{"$f":"IF(DEC!J6=\"\",\"\",DEC!J6)","v":""},{"$f":"IF(DEC!K6=\"\",\"\",DEC!K6)","v":""},{"$f":"IF(DEC!L6=\"\",\"\",DEC!L6)","v":""},{"$f":"IF(DEC!M6=\"\",\"\",DEC!M6)","v":""}]
[50,{"$f":"IF(DEC!B7=\"\",\"\",DEC!B7)","v":0},{"$f":"IF(DEC!C7=\"\",\"\",DEC!C7)","v":0},{"$f":"IF(DEC!D7=\"\",\"\",DEC!D7)","v":0},{"$f":"IF(DEC!E7=\"\",\"\",DEC!E7)","v":""},{"$f":"IF(DEC!F7=\"\",\"\",DEC!F7)","v":0},{"$f":"IF(DEC!G7=\"\",\"\",DEC!G7)","v":0},{"$f":"IF(DEC!H7=\"\",\"\",DEC!H7)","v":""},{"$f":"IF(DEC!I7=\"\",\"\",DEC!I7)","v":0},{"$f":"IF(DEC!J7=\"\",\"\",DEC!J7)","v":""},{"$f":"IF(DEC!K7=\"\",\"\",DEC!K7)","v":""},{"$f":"IF(DEC!L7=\"\",\"\",DEC!L7)","v":""},{"$f":"IF(DEC!M7=\"\",\"\",DEC!M7)","v":""}]
[51,{"$f":"IF(DEC!B8=\"\",\"\",DEC!B8)","v":0},{"$f":"IF(DEC!C8=\"\",\"\",DEC!C8)","v":0},{"$f":"IF(DEC!D8=\"\",\"\",DEC!D8)","v":0},{"$f":"IF(DEC!E8=\"\",\"\",DEC!E8)","v":""},{"$f":"IF(DEC!F8=\"\",\"\",DEC!F8)","v":0},{"$f":"IF(DEC!G8=\"\",\"\",DEC!G8)","v":0},{"$f":"IF(DEC!H8=\"\",\"\",DEC!H8)","v":""},{"$f":"IF(DEC!I8=\"\",\"\",DEC!I8)","v":0},{"$f":"IF(DEC!J8=\"\",\"\",DEC!J8)","v":""},{"$f":"IF(DEC!K8=\"\",\"\",DEC!K8)","v":""},{"$f":"IF(DEC!L8=\"\",\"\",DEC!L8)","v":""},{"$f":"IF(DEC!M8=\"\",\"\",DEC!M8)","v":""}]
[52,{"$f":"IF(DEC!B9=\"\",\"\",DEC!B9)","v":0},{"$f":"IF(DEC!C9=\"\",\"\",DEC!C9)","v":0},{"$f":"IF(DEC!D9=\"\",\"\",DEC!D9)","v":0},{"$f":"IF(DEC!E9=\"\",\"\",DEC!E9)","v":""},{"$f":"IF(DEC!F9=\"\",\"\",DEC!F9)","v":0},{"$f":"IF(DEC!G9=\"\",\"\",DEC!G9)","v":0},{"$f":"IF(DEC!H9=\"\",\"\",DEC!H9)","v":""},{"$f":"IF(DEC!I9=\"\",\"\",DEC!I9)","v":0},{"$f":"IF(DEC!J9=\"\",\"\",DEC!J9)","v":""},{"$f":"IF(DEC!K9=\"\",\"\",DEC!K9)","v":""},{"$f":"IF(DEC!L9=\"\",\"\",DEC!L9)","v":""},{"$f":"IF(DEC!M9=\"\",\"\",DEC!M9)","v":""}]
[53,{"$f":"IF(DEC!B10=\"\",\"\",DEC!B10)","v":0},{"$f":"IF(DEC!C10=\"\",\"\",DEC!C10)","v":0},{"$f":"IF(DEC!D10=\"\",\"\",DEC!D10)","v":0},{"$f":"IF(DEC!E10=\"\",\"\",DEC!E10)","v":""},{"$f":"IF(DEC!F10=\"\",\"\",DEC!F10)","v":0},{"$f":"IF(DEC!G10=\"\",\"\",DEC!G10)","v":0},{"$f":"IF(DEC!H10=\"\",\"\",DEC!H10)","v":""},{"$f":"IF(DEC!I10=\"\",\"\",DEC!I10)","v":0},{"$f":"IF(DEC!J10=\"\",\"\",DEC!J10)","v":""},{"$f":"IF(DEC!K10=\"\",\"\",DEC!K10)","v":""},{"$f":"IF(DEC!L10=\"\",\"\",DEC!L10)","v":""},{"$f":"IF(DEC!M10=\"\",\"\",DEC!M10)","v":""}]
[]
[]
["MONTHLY AVERAGES"]
["Month",{"$f":"B6","v":"Worship Attend"},"","","Giving","","","SG or Other","Youth Group","Conversions","Baptisms","Growth decisions","Members Added"]
["JAN",{"$f":"IF(SUM(B7:B10)=0,\"\",(SUM(B7:B10)/(COUNTIF(B7:B10,\">0\"))))","v":""},"","","","","","","",{"$f":"IF(SUM(J7:J10)=0,\"\",SUM(J7:J10))","v":""},{"$f":"IF(SUM(K7:K10)=0,\"\",SUM(K7:K10))","v":""},{"$f":"IF(SUM(L7:L10)=0,\"\",SUM(L7:L10))","v":""},{"$f":"IF(SUM(M7:M10)=0,\"\",SUM(M7:M10))","v":""}]
["FEB",{"$f":"IF(SUM(B11:B14)=0,\"\",(SUM(B11:B14)/(COUNTIF(B11:B14,\">0\"))))","v":""},{"$f":"IF(SUM(C11:C14)=0,\"\",(SUM(C11:C14)/(COUNTIF(C11:C14,\">0\"))))","v":""},{"$f":"IF(SUM(D11:D14)=0,\"\",(SUM(D11:D14)/(COUNTIF(D11:D14,\">0\"))))","v":""},{"$f":"IF(SUM(E11:E14)=0,\"\",(SUM(E11:E14)/(COUNTIF(E11:E14,\">0\"))))","v":""},{"$f":"IF(SUM(F11:F14)=0,\"\",(SUM(F11:F14)/(COUNTIF(F11:F14,\">0\"))))","v":""},{"$f":"IF(SUM(G8:G11)=0,\"\",(SUM(G8:G11)/(COUNTIF(G8:G11,\">0\"))))","v":""},{"$f":"IF(SUM(H11:H14)=0,\"\",(SUM(H11:H14)/(COUNTIF(H11:H14,\">0\"))))","v":""},{"$f":"IF(SUM(I11:I14)=0,\"\",(SUM(I11:I14)/(COUNTIF(I11:I14,\">0\"))))","v":""},{"$f":"IF(SUM(J11:J14)=0,\"\",SUM(J11:J14))","v":""},{"$f":"IF(SUM(K11:K14)=0,\"\",SUM(K11:K14))","v":""},{"$f":"IF(SUM(L11:L14)=0,\"\",SUM(L11:L14))","v":""},{"$f":"IF(SUM(M11:M14)=0,\"\",SUM(M11:M14))","v":""}]
["MAR",{"$f":"IF(SUM(B15:B18)=0,\"\",(SUM(B15:B18)/(COUNTIF(B15:B18,\">0\"))))","v":""},{"$f":"IF(SUM(C15:C18)=0,\"\",(SUM(C15:C18)/(COUNTIF(C15:C18,\">0\"))))","v":""},{"$f":"IF(SUM(D15:D18)=0,\"\",(SUM(D15:D18)/(COUNTIF(D15:D18,\">0\"))))","v":""},{"$f":"IF(SUM(E15:E18)=0,\"\",(SUM(E15:E18)/(COUNTIF(E15:E18,\">0\"))))","v":""},{"$f":"IF(SUM(F15:F18)=0,\"\",(SUM(F15:F18)/(COUNTIF(F15:F18,\">0\"))))","v":""},{"$f":"IF(SUM(G9:G12)=0,\"\",(SUM(G9:G12)/(COUNTIF(G9:G12,\">0\"))))","v":""},{"$f":"IF(SUM(H15:H18)=0,\"\",(SUM(H15:H18)/(COUNTIF(H15:H18,\">0\"))))","v":""},{"$f":"IF(SUM(I15:I18)=0,\"\",(SUM(I15:I18)/(COUNTIF(I15:I18,\">0\"))))","v":""},{"$f":"IF(SUM(J15:J18)=0,\"\",SUM(J15:J18))","v":""},{"$f":"IF(SUM(K15:K18)=0,\"\",SUM(K15:K18))","v":""},{"$f":"IF(SUM(L15:L18)=0,\"\",SUM(L15:L18))","v":""},{"$f":"IF(SUM(M15:M18)=0,\"\",SUM(M15:M18))","v":""}]
["APR",{"$f":"IF(SUM(B19:B23)=0,\"\",(SUM(B19:B23)/(COUNTIF(B19:B23,\">0\"))))","v":""},{"$f":"IF(SUM(C19:C23)=0,\"\",(SUM(C19:C23)/(COUNTIF(C19:C23,\">0\"))))","v":""},{"$f":"IF(SUM(D19:D23)=0,\"\",(SUM(D19:D23)/(COUNTIF(D19:D23,\">0\"))))","v":""},{"$f":"IF(SUM(E19:E23)=0,\"\",(SUM(E19:E23)/(COUNTIF(E19:E23,\">0\"))))","v":""},{"$f":"IF(SUM(F19:F23)=0,\"\",(SUM(F19:F23)/(COUNTIF(F19:F23,\">0\"))))","v":""},{"$f":"IF(SUM(G10:G13)=0,\"\",(SUM(G10:G13)/(COUNTIF(G10:G13,\">0\"))))","v":""},{"$f":"IF(SUM(H19:H23)=0,\"\",(SUM(H19:H23)/(COUNTIF(H19:H23,\">0\"))))","v":""},{"$f":"IF(SUM(I19:I23)=0,\"\",(SUM(I19:I23)/(COUNTIF(I19:I23,\">0\"))))","v":""},{"$f":"IF(SUM(J19:J23)=0,\"\",SUM(J19:J23))","v":""},{"$f":"IF(SUM(K19:K23)=0,\"\",SUM(K19:K23))","v":""},{"$f":"IF(SUM(L19:L23)=0,\"\",SUM(L19:L23))","v":""},{"$f":"IF(SUM(M19:M23)=0,\"\",SUM(M19:M23))","v":""}]
["MAY",{"$f":"IF(SUM(B24:B27)=0,\"\",(SUM(B24:B27)/(COUNTIF(B24:B27,\">0\"))))","v":""},{"$f":"IF(SUM(C24:C27)=0,\"\",(SUM(C24:C27)/(COUNTIF(C24:C27,\">0\"))))","v":""},{"$f":"IF(SUM(D24:D27)=0,\"\",(SUM(D24:D27)/(COUNTIF(D24:D27,\">0\"))))","v":""},{"$f":"IF(SUM(E24:E27)=0,\"\",(SUM(E24:E27)/(COUNTIF(E24:E27,\">0\"))))","v":""},{"$f":"IF(SUM(F24:F27)=0,\"\",(SUM(F24:F27)/(COUNTIF(F24:F27,\">0\"))))","v":""},{"$f":"IF(SUM(G11:G14)=0,\"\",(SUM(G11:G14)/(COUNTIF(G11:G14,\">0\"))))","v":""},{"$f":"IF(SUM(H24:H27)=0,\"\",(SUM(H24:H27)/(COUNTIF(H24:H27,\">0\"))))","v":""},{"$f":"IF(SUM(I24:I27)=0,\"\",(SUM(I24:I27)/(COUNTIF(I24:I27,\">0\"))))","v":""},{"$f":"IF(SUM(J24:J27)=0,\"\",SUM(J24:J27))","v":""},{"$f":"IF(SUM(K24:K27)=0,\"\",SUM(K24:K27))","v":""},{"$f":"IF(SUM(L24:L27)=0,\"\",SUM(L24:L27))","v":""},{"$f":"IF(SUM(M24:M27)=0,\"\",SUM(M24:M27))","v":""}]
["JUNE",{"$f":"IF(SUM(B28:B31)=0,\"\",(SUM(B28:B31)/(COUNTIF(B28:B31,\">0\"))))","v":""},{"$f":"IF(SUM(C28:C31)=0,\"\",(SUM(C28:C31)/(COUNTIF(C28:C31,\">0\"))))","v":""},{"$f":"IF(SUM(D28:D31)=0,\"\",(SUM(D28:D31)/(COUNTIF(D28:D31,\">0\"))))","v":""},{"$f":"IF(SUM(E28:E31)=0,\"\",(SUM(E28:E31)/(COUNTIF(E28:E31,\">0\"))))","v":""},{"$f":"IF(SUM(F28:F31)=0,\"\",(SUM(F28:F31)/(COUNTIF(F28:F31,\">0\"))))","v":""},{"$f":"IF(SUM(G11:G15)=0,\"\",(SUM(G11:G15)/(COUNTIF(G11:G15,\">0\"))))","v":""},{"$f":"IF(SUM(H28:H31)=0,\"\",(SUM(H28:H31)/(COUNTIF(H28:H31,\">0\"))))","v":""},{"$f":"IF(SUM(I28:I31)=0,\"\",(SUM(I28:I31)/(COUNTIF(I28:I31,\">0\"))))","v":""},{"$f":"IF(SUM(J28:J31)=0,\"\",SUM(J28:J31))","v":""},{"$f":"IF(SUM(K28:K31)=0,\"\",SUM(K28:K31))","v":""},{"$f":"IF(SUM(L28:L31)=0,\"\",SUM(L28:L31))","v":""},{"$f":"IF(SUM(M28:M31)=0,\"\",SUM(M28:M31))","v":""}]
["JULY",{"$f":"IF(SUM(B32:B36)=0,\"\",(SUM(B32:B36)/(COUNTIF(B32:B36,\">0\"))))","v":""},{"$f":"IF(SUM(C32:C36)=0,\"\",(SUM(C32:C36)/(COUNTIF(C32:C36,\">0\"))))","v":""},{"$f":"IF(SUM(D32:D36)=0,\"\",(SUM(D32:D36)/(COUNTIF(D32:D36,\">0\"))))","v":""},{"$f":"IF(SUM(E32:E36)=0,\"\",(SUM(E32:E36)/(COUNTIF(E32:E36,\">0\"))))","v":""},{"$f":"IF(SUM(F32:F36)=0,\"\",(SUM(F32:F36)/(COUNTIF(F32:F36,\">0\"))))","v":""},"",{"$f":"IF(SUM(H32:H36)=0,\"\",(SUM(H32:H36)/(COUNTIF(H32:H36,\">0\"))))","v":""},{"$f":"IF(SUM(I32:I36)=0,\"\",(SUM(I32:I36)/(COUNTIF(I32:I36,\">0\"))))","v":""},{"$f":"IF(SUM(J32:J36)=0,\"\",SUM(J32:J36))","v":""},{"$f":"IF(SUM(K32:K36)=0,\"\",SUM(K32:K36))","v":""},{"$f":"IF(SUM(L32:L36)=0,\"\",SUM(L32:L36))","v":""},{"$f":"IF(SUM(M32:M36)=0,\"\",SUM(M32:M36))","v":""}]
["AUG",{"$f":"IF(SUM(B37:B40)=0,\"\",(SUM(B37:B40)/(COUNTIF(B37:B40,\">0\"))))","v":""},{"$f":"IF(SUM(C37:C40)=0,\"\",(SUM(C37:C40)/(COUNTIF(C37:C40,\">0\"))))","v":""},{"$f":"IF(SUM(D37:D40)=0,\"\",(SUM(D37:D40)/(COUNTIF(D37:D40,\">0\"))))","v":""},{"$f":"IF(SUM(E37:E40)=0,\"\",(SUM(E37:E40)/(COUNTIF(E37:E40,\">0\"))))","v":""},{"$f":"IF(SUM(F37:F40)=0,\"\",(SUM(F37:F40)/(COUNTIF(F37:F40,\">0\"))))","v":""},"",{"$f":"IF(SUM(H37:H40)=0,\"\",(SUM(H37:H40)/(COUNTIF(H37:H40,\">0\"))))","v":""},{"$f":"IF(SUM(I37:I40)=0,\"\",(SUM(I37:I40)/(COUNTIF(I37:I40,\">0\"))))","v":""},{"$f":"IF(SUM(J37:J40)=0,\"\",SUM(J37:J40))","v":""},{"$f":"IF(SUM(K37:K40)=0,\"\",SUM(K37:K40))","v":""},{"$f":"IF(SUM(L37:L40)=0,\"\",SUM(L37:L40))","v":""},{"$f":"IF(SUM(M37:M40)=0,\"\",SUM(M37:M40))","v":""}]
["SEP",{"$f":"IF(SUM(B41:B44)=0,\"\",(SUM(B41:B44)/(COUNTIF(B41:B44,\">0\"))))","v":""},{"$f":"IF(SUM(C41:C44)=0,\"\",(SUM(C41:C44)/(COUNTIF(C41:C44,\">0\"))))","v":""},{"$f":"IF(SUM(D41:D44)=0,\"\",(SUM(D41:D44)/(COUNTIF(D41:D44,\">0\"))))","v":""},{"$f":"IF(SUM(E41:E44)=0,\"\",(SUM(E41:E44)/(COUNTIF(E41:E44,\">0\"))))","v":""},{"$f":"IF(SUM(F41:F44)=0,\"\",(SUM(F41:F44)/(COUNTIF(F41:F44,\">0\"))))","v":""},"",{"$f":"IF(SUM(H41:H44)=0,\"\",(SUM(H41:H44)/(COUNTIF(H41:H44,\">0\"))))","v":""},{"$f":"IF(SUM(I41:I44)=0,\"\",(SUM(I41:I44)/(COUNTIF(I41:I44,\">0\"))))","v":""},{"$f":"IF(SUM(J41:J44)=0,\"\",SUM(J41:J44))","v":""},{"$f":"IF(SUM(K41:K44)=0,\"\",SUM(K41:K44))","v":""},{"$f":"IF(SUM(L41:L44)=0,\"\",SUM(L41:L44))","v":""},{"$f":"IF(SUM(M41:M44)=0,\"\",SUM(M41:M44))","v":""}]
["OCT",{"$f":"IF(SUM(B46:B49)=0,\"\",(SUM(B46:B49)/(COUNTIF(B46:B49,\">0\"))))","v":""},{"$f":"IF(SUM(C46:C49)=0,\"\",(SUM(C46:C49)/(COUNTIF(C46:C49,\">0\"))))","v":""},{"$f":"IF(SUM(D46:D49)=0,\"\",(SUM(D46:D49)/(COUNTIF(D46:D49,\">0\"))))","v":""},{"$f":"IF(SUM(E46:E49)=0,\"\",(SUM(E46:E49)/(COUNTIF(E46:E49,\">0\"))))","v":""},{"$f":"IF(SUM(F46:F49)=0,\"\",(SUM(F46:F49)/(COUNTIF(F46:F49,\">0\"))))","v":""},"",{"$f":"IF(SUM(H46:H49)=0,\"\",(SUM(H46:H49)/(COUNTIF(H46:H49,\">0\"))))","v":""},{"$f":"IF(SUM(I46:I49)=0,\"\",(SUM(I46:I49)/(COUNTIF(I46:I49,\">0\"))))","v":""},{"$f":"IF(SUM(J46:J49)=0,\"\",SUM(J46:J49))","v":""},{"$f":"IF(SUM(K46:K49)=0,\"\",SUM(K46:K49))","v":""},{"$f":"IF(SUM(L46:L49)=0,\"\",SUM(L46:L49))","v":""},{"$f":"IF(SUM(M46:M49)=0,\"\",SUM(M46:M49))","v":""}]
["NOV",{"$f":"IF(SUM(B50:B53)=0,\"\",(SUM(B50:B53)/(COUNTIF(B50:B53,\">0\"))))","v":""},{"$f":"IF(SUM(C50:C53)=0,\"\",(SUM(C50:C53)/(COUNTIF(C50:C53,\">0\"))))","v":""},{"$f":"IF(SUM(D50:D53)=0,\"\",(SUM(D50:D53)/(COUNTIF(D50:D53,\">0\"))))","v":""},{"$f":"IF(SUM(E50:E53)=0,\"\",(SUM(E50:E53)/(COUNTIF(E50:E53,\">0\"))))","v":""},{"$f":"IF(SUM(F50:F53)=0,\"\",(SUM(F50:F53)/(COUNTIF(F50:F53,\">0\"))))","v":""},"",{"$f":"IF(SUM(H50:H53)=0,\"\",(SUM(H50:H53)/(COUNTIF(H50:H53,\">0\"))))","v":""},{"$f":"IF(SUM(I50:I53)=0,\"\",(SUM(I50:I53)/(COUNTIF(I50:I53,\">0\"))))","v":""},{"$f":"IF(SUM(J50:J53)=0,\"\",SUM(J50:J53))","v":""},{"$f":"IF(SUM(K50:K53)=0,\"\",SUM(K50:K53))","v":""},{"$f":"IF(SUM(L50:L53)=0,\"\",SUM(L50:L53))","v":""},{"$f":"IF(SUM(M50:M53)=0,\"\",SUM(M50:M53))","v":""}]
["DEC",{"$f":"IF(SUM(B54:B58)=0,\"\",(SUM(B54:B58)/(COUNTIF(B54:B58,\">0\"))))","v":""},{"$f":"IF(SUM(C54:C58)=0,\"\",(SUM(C54:C58)/(COUNTIF(C54:C58,\">0\"))))","v":""},{"$f":"IF(SUM(D54:D58)=0,\"\",(SUM(D54:D58)/(COUNTIF(D54:D58,\">0\"))))","v":""},{"$f":"IF(SUM(E54:E58)=0,\"\",(SUM(E54:E58)/(COUNTIF(E54:E58,\">0\"))))","v":""},{"$f":"IF(SUM(F54:F58)=0,\"\",(SUM(F54:F58)/(COUNTIF(F54:F58,\">0\"))))","v":""},"",{"$f":"IF(SUM(H54:H58)=0,\"\",(SUM(H54:H58)/(COUNTIF(H54:H58,\">0\"))))","v":""},{"$f":"IF(SUM(I54:I58)=0,\"\",(SUM(I54:I58)/(COUNTIF(I54:I58,\">0\"))))","v":""},{"$f":"IF(SUM(J54:J58)=0,\"\",SUM(J54:J58))","v":""},{"$f":"IF(SUM(K54:K58)=0,\"\",SUM(K54:K58))","v":""},{"$f":"IF(SUM(L54:L58)=0,\"\",SUM(L54:L58))","v":""},{"$f":"IF(SUM(M54:M58)=0,\"\",SUM(M54:M58))","v":""}]

{"sheet":"Commitments","index":15,"n_rows":12,"n_cols":15,"rows_kept":12,"cut":false,"hidden":false,"merged":[[10,0,11,0],[10,1,10,2],[11,1,11,2],[6,0,9,0],[6,1,6,2],[7,1,7,2],[8,1,8,2],[9,1,9,2],[0,0,0,14],[2,0,5,0],[2,1,2,2],[3,1,3,2],[4,1,4,2],[5,1,5,2]]}
["The Three Spheres of Commitments"]
[null,null,null,"JAN","FEB","MAR","APR","MAY","JUN","JUL","AUG","SEP","OCT","NOV","DEC"]
["Fit","Physically",null,{"$f":"JAN!U25","v":""},{"$f":"FEB!U19","v":""},{"$f":"MAR!U19","v":""},{"$f":"APR!U19","v":""},{"$f":"MAY!U19","v":""},{"$f":"JUNE!U19","v":""},{"$f":"JULY!U19","v":""},{"$f":"AUG!U19","v":""},{"$f":"SEPT!U19","v":""},{"$f":"OCT!U19","v":""},{"$f":"NOV!U19","v":""},{"$f":"DEC!U19","v":""}]
[null,"Intellectually",null,{"$f":"JAN!U26","v":""},{"$f":"FEB!U20","v":""},{"$f":"MAR!U20","v":""},{"$f":"APR!U20","v":""},{"$f":"MAY!U20","v":""},{"$f":"JUNE!U20","v":""},{"$f":"JULY!U20","v":""},{"$f":"AUG!U20","v":""},{"$f":"SEPT!U20","v":""},{"$f":"OCT!U20","v":""},{"$f":"NOV!U20","v":""},{"$f":"DEC!U20","v":""}]
[null,"Relationally",null,{"$f":"JAN!U27","v":""},{"$f":"FEB!U21","v":""},{"$f":"MAR!U21","v":""},{"$f":"APR!U21","v":""},{"$f":"MAY!U21","v":""},{"$f":"JUNE!U21","v":""},{"$f":"JULY!U21","v":""},{"$f":"AUG!U21","v":""},{"$f":"SEPT!U21","v":""},{"$f":"OCT!U21","v":""},{"$f":"NOV!U21","v":""},{"$f":"DEC!U21","v":""}]
[null,"Spiritually",null,{"$f":"JAN!U28","v":""},{"$f":"FEB!U22","v":""},{"$f":"MAR!U22","v":""},{"$f":"APR!U22","v":""},{"$f":"MAY!U22","v":""},{"$f":"JUNE!U22","v":""},{"$f":"JULY!U22","v":""},{"$f":"AUG!U22","v":""},{"$f":"SEPT!U22","v":""},{"$f":"OCT!U22","v":""},{"$f":"NOV!U22","v":""},{"$f":"DEC!U22","v":""}]
["Faithful","Marriage",null,{"$f":"JAN!U29","v":""},{"$f":"FEB!U23","v":""},{"$f":"MAR!U23","v":""},{"$f":"APR!U23","v":""},{"$f":"MAY!U23","v":""},{"$f":"JUNE!U23","v":""},{"$f":"JULY!U23","v":""},{"$f":"AUG!U23","v":""},{"$f":"SEPT!U23","v":""},{"$f":"OCT!U23","v":""},{"$f":"NOV!U23","v":""},{"$f":"DEC!U23","v":""}]
[null,"Parenting",null,{"$f":"JAN!U30","v":""},{"$f":"FEB!U24","v":""},{"$f":"MAR!U24","v":""},{"$f":"APR!U24","v":""},{"$f":"MAY!U24","v":""},{"$f":"JUNE!U24","v":""},{"$f":"JULY!U24","v":""},{"$f":"AUG!U24","v":""},{"$f":"SEPT!U24","v":""},{"$f":"OCT!U24","v":""},{"$f":"NOV!U24","v":""},{"$f":"DEC!U24","v":""}]
[null,"Ministry",null,{"$f":"JAN!U31","v":""},{"$f":"FEB!U25","v":""},{"$f":"MAR!U25","v":""},{"$f":"APR!U25","v":""},{"$f":"MAY!U25","v":""},{"$f":"JUNE!U25","v":""},{"$f":"JULY!U25","v":""},{"$f":"AUG!U25","v":""},{"$f":"SEPT!U25","v":""},{"$f":"OCT!U25","v":""},{"$f":"NOV!U25","v":""},{"$f":"DEC!U25","v":""}]
[null,"Finances",null,{"$f":"JAN!U32","v":""},{"$f":"FEB!U26","v":""},{"$f":"MAR!U26","v":""},{"$f":"APR!U26","v":""},{"$f":"MAY!U26","v":""},{"$f":"JUNE!U26","v":""},{"$f":"JULY!U26","v":""},{"$f":"AUG!U26","v":""},{"$f":"SEPT!U26","v":""},{"$f":"OCT!U26","v":""},{"$f":"NOV!U26","v":""},{"$f":"DEC!U26","v":""}]
["Fruitful","The Lost",null,{"$f":"JAN!U33","v":""},{"$f":"FEB!U27","v":""},{"$f":"MAR!U27","v":""},{"$f":"APR!U27","v":""},{"$f":"MAY!U27","v":""},{"$f":"JUNE!U27","v":""},{"$f":"JULY!U27","v":""},{"$f":"AUG!U27","v":""},{"$f":"SEPT!U27","v":""},{"$f":"OCT!U27","v":""},{"$f":"NOV!U27","v":""},{"$f":"DEC!U27","v":""}]
[null,"Other Believers",null,{"$f":"JAN!U34","v":""},{"$f":"FEB!U28","v":""},{"$f":"MAR!U28","v":""},{"$f":"APR!U28","v":""},{"$f":"MAY!U28","v":""},{"$f":"JUNE!U28","v":""},{"$f":"JULY!U28","v":""},{"$f":"AUG!U28","v":""},{"$f":"SEPT!U28","v":""},{"$f":"OCT!U28","v":""},{"$f":"NOV!U28","v":""},{"$f":"DEC!U28","v":""}]